{"text_format":"1","workbook":"xlsx","n_sheets":62,"sheets":["Reception","Données","Aide","Stats APSA proposées","VANUATU","9830681Y","9830656w","9830649N","9830640D","9830639C","9830632V","9830626N","9830625M","9830624L","9830616c","9830538T","9830524C","9830522A","9830508K","9830493U","9830492T","9830482G","9830477B","9830474Y","9830419n","9830418M","9830414H","9830384A","9830357W","9830356V","9830355U","9830304N","9830278k","9830277J","9830010U","9830009T","9830008S","9830007R","9830004M","9830609V","9830518W","9830447U","9830432C","9830420P","9830400T","9830392j","9830382Y","9830381X","9830354T","9830298G","9830297F","9830295D","9830271C","9830270B","9830267Y","9830266X","9830265W","9830264V","9830263U","9830260R","9830259P","formules"],"not_rendered":{"charts":0,"images":3,"macros":1,"external_links":2,"defined_names":11,"comments":0,"pivot_tables":0},"unopened":[],"bounds":{"document_bytes":16777216,"sheet_cells":100000,"rows_first":2000,"rows_last":500,"rows_between":2000,"halvings":0,"cell_chars":16384,"cell_head_chars":4096},"cells_cut":0,"cells_raw":0,"read":"whole","date_system":"1900"}

{"sheet":"Reception","index":0,"n_rows":603,"n_cols":9,"rows_kept":603,"cut":false,"hidden":false,"merged":[]}
["RNE","Etablissement","Date","Version","Validité","NBR RETOURS",{"$f":"Données!M9","v":"Académie de Nouvelle-Calédonie"}]
["9830259P",{"$f":"IF(ISERROR(VLOOKUP(A2,etab,2,FALSE)),\"\",VLOOKUP(A2,etab,2,FALSE))","v":"CLG CHAMPAGNAT - NOUMEA"},"21-07-2014","8_26/11/13",null,{"$f":"COUNTA(C2:C603)","v":57},"Gestion Établissement du Brevet en EPS",null,"OUTILS"]
["9830260R","CLG SAINT JOSEPH DE CLUNY - NOUMEA","21-07-2014","8_26/11/13",null,null,{"$f":"\"Session \" &Données!M10","v":"Session 2014"}]
["9830263U","CLG MARIE REINE THABOR - MONT DORE","21-07-2014","8_26/11/13",null,null,"Récupération des PROTOCOLES"]
["9830264V","CLG SAINTE MARIE - PAITA","21-07-2014","8_26/11/13"]
["9830265W","CLG SACRE CŒUR - BOURAIL","21-07-2014","8_26/11/13"]
["9830266X","CLG GUILLAUME DOUARRE - OUVEA","21-07-2014","8_26/11/13"]
["9830267Y","CLG DO NEVA - HOUAILOU","21-07-2014","8_26/11/13"]
["9830270B","LP JEAN 23","21-07-2014","8_26/11/13"]
["9830271C","LP CHAMPAGNAT","21-07-2014","8_26/11/13",null,null,"Vous avez choisi ce chemin"]
["9830295D","CLG HAVILA - LIFOU","21-07-2014","8_26/11/13",null,null,"Z:\\EPS\\EXAMENS + BNSSA etc\\DNB CLG\\LOGICIEL 2014\\RETOUR FICHIERS ETAB PROTOCOLE 2014\\"]
["9830297F","CLG HIPPOLYTE BONOU - POUEBO","21-07-2014","8_26/11/13"]
["9830298G","CLG FRANCIS ROUGE - THIO","21-07-2014","8_26/11/13"]
["9830354T","CLG SAINT JOSEPH - VAO ILES DES PINS","21-07-2014","8_26/11/13"]
["9830381X","CLG SAINT DOMINIQUE SAVIO - LA FOA","21-07-2014","8_26/11/13"]
["9830382Y","CLG J.B. VIGOUROUX - POINDIMIE","21-07-2014","8_26/11/13"]
["9830392j","CLG TAREMEN - MARE","21-07-2014","8_26/11/13",null,null,"Tableau des retours & Paramétrages"]
["9830400T","CLG DE NATHALO - LIFOU","21-07-2014","8_26/11/13"]
["9830420P","CLG HNAIZIANU - LIFOU","21-07-2014","8_26/11/13",null,null,"Statistiques académiques"]
["9830432C","CLG TIETA - VOH","21-07-2014","8_26/11/13"]
["9830447U","CLG EBEN EZA - OUVEA","21-07-2014","8_26/11/13",null,null,"Aide"]
["9830518W","CLG BOUAVA KALEBA - POUM","21-07-2014","8_26/11/13",null,null,"Pascal Combettes, Aurélien Marchesnay © 2012"]
["9830609V","CLG GELIMA - CANALA","21-07-2014","8_26/11/13",null,null,{"$f":"Données!M11","v":"V3_29/10/13"}]
["9830004M","CLG GEORGES BAUDOUX - NOUMEA","21-07-2014","8_26/11/13"]
["9830007R","CLG DE KOUMAC ET SEGPA","21-07-2014","8_26/11/13"]
["9830008S","CLG RAYMOND VAUTHIER ET SEGPA - POINDIMIE","21-07-2014","8_26/11/13"]
["9830009T","CLG DE LA FOA","21-07-2014","8_26/11/13"]
["9830010U","CLG LOUIS LEOPOLD DJIET ET SEGPA - BOURAIL","21-07-2014","8_26/11/13"]
["9830277J","CLG JEAN MARIOTTI - NOUMEA","21-07-2014","8_26/11/13"]
["9830278k","CLG DE KONE","21-07-2014","8_26/11/13"]
["9830304N","CLG DE RIVIERE SALEE - NOUMEA","21-07-2014","8_26/11/13"]
["9830355U","CLG DE THIO","21-07-2014","8_26/11/13"]
["9830356V","CLG DE MAGENTA ET SEGPA - NOUMEA","21-07-2014","8_26/11/13"]
["9830357W","CLG LAURA BOULA ET SEGPA - WE LIFOU","21-07-2014","8_26/11/13"]
["9830384A","CLG DE BOULARI ET SEGPA","21-07-2014","8_26/11/13"]
["9830414H","CLG TADINE - MARE","21-07-2014","8_26/11/13"]
["9830418M","CLG DE WANI ET SEGPA  - HOUAILOU","21-07-2014","8_26/11/13"]
["9830419n","CLG DE CANALA ET SEGPA","21-07-2014","8_26/11/13"]
["9830474Y","CLG FRANCIS CARCO ET SEGPA - KOUTIO","21-07-2014","8_26/11/13"]
["9830477B","CLG DE YATE","21-07-2014","8_26/11/13"]
["9830482G","CLG LA ROCHE ET SEGPA - MARE","21-07-2014","8_26/11/13"]
["9830492T","GOD KOUAOUA","21-07-2014","8_26/11/13"]
["9830493U","CLG DE POYA","21-07-2014","8_26/11/13"]
["9830508K","ALP VALLEE DU TIR","21-07-2014","8_26/11/13"]
["9830522A","CLG PAI-KALEONE - HIENGHENE","21-07-2014","8_26/11/13"]
["9830524C","CLG DE KAMERE - NOUMEA","21-07-2014","8_26/11/13"]
["9830538T","CLG DE NORMANDIE ET SEGPA","21-07-2014","8_26/11/13"]
["9830616c","CLG LOUISE MICHEL DE PAITA SUD - PAITA","21-07-2014","8_26/11/13"]
["9830624L","CLG DE PLUM","21-07-2014","8_26/11/13"]
["9830625M","CLG PORTES DE FER ET SEGPA - NOUMEA","21-07-2014","8_26/11/13"]
["9830626N","CLG JEAN FAYARD - KATIRAMONA","21-07-2014","8_26/11/13"]
["9830632V","CLG DE OUEGOA","21-07-2014","8_26/11/13"]
["9830639C","CLG OUVEA ET SEGPA","21-07-2014","8_26/11/13"]
["9830640D","CLG EDMEE VARIN AUTEUIL ET SEGPA - NOUMEA","21-07-2014","8_26/11/13"]
["9830649N","CLG ALAIN MERMOUD TUBAND - NOUMEA","21-07-2014","8_26/11/13"]
["9830656w","CLG DE PAITA NORD - PAITA","21-07-2014","8_26/11/13"]
["9830681Y","CLG DUMBEA SUR MER","21-07-2014","8_26/11/13"]
["VANUATU","CLG LE CLEZIO VANUATU","21-07-2014","8_26/11/13"]
[null,""]
[null,""]
[null,""]
[null,""]
[null,""]
[null,""]
[null,""]
[null,{"$f":"IF(ISERROR(VLOOKUP(A66,etab,2,FALSE)),\"\",VLOOKUP(A66,etab,2,FALSE))","v":""}]
[null,""]
[null,""]
[null,""]
[null,""]
[null,""]
[null,""]
[null,""]
[null,""]
[null,""]
[null,""]
[null,""]
[null,""]
[null,""]
[null,""]
[null,""]
[null,""]
[null,""]
[null,""]
[null,""]
[null,""]
[null,""]
[null,""]
[null,""]
[null,""]
[null,""]
[null,""]
[null,""]
[null,""]
[null,""]
[null,{"$f":"IF(ISERROR(VLOOKUP(A96,etab,2,FALSE)),\"\",VLOOKUP(A96,etab,2,FALSE))","v":""}]
[null,""]
[null,""]
[null,""]
[null,""]
[null,""]
[null,""]
[null,""]
[null,""]
[null,""]
[null,""]
[null,""]
[null,""]
[null,""]
[null,""]
[null,""]
[null,""]
[null,""]
[null,""]
[null,""]
[null,""]
[null,""]
[null,""]
[null,""]
[null,""]
[null,""]
[null,""]
[null,""]
[null,""]
[null,""]
[null,""]
[null,""]
[null,""]
[null,""]
[null,{"$f":"IF(ISERROR(VLOOKUP(A130,etab,2,FALSE)),\"\",VLOOKUP(A130,etab,2,FALSE))","v":""}]
[null,""]
[null,""]
[null,""]
[null,""]
[null,""]
[null,""]
[null,""]
[null,""]
[null,""]
[null,""]
[null,""]
[null,""]
[null,""]
[null,""]
[null,""]
[null,""]
[null,""]
[null,""]
[null,""]
[null,""]
[null,""]
[null,""]
[null,""]
[null,""]
[null,""]
[null,""]
[null,""]
[null,""]
[null,""]
[null,""]
[null,""]
[null,""]
[null,""]
[null,""]
[null,""]
[null,""]
[null,""]
[null,""]
[null,""]
[null,""]
[null,""]
[null,""]
[null,""]
[null,""]
[null,""]
[null,""]
[null,""]
[null,""]
[null,""]
[null,""]
[null,""]
[null,""]
[null,""]
[null,""]
[null,""]
[null,""]
[null,""]
[null,""]
[null,""]
[null,""]
[null,""]
[null,""]
[null,""]
[null,{"$f":"IF(ISERROR(VLOOKUP(A194,etab,2,FALSE)),\"\",VLOOKUP(A194,etab,2,FALSE))","v":""}]
[null,""]
[null,""]
[null,""]
[null,""]
[null,""]
[null,""]
[null,""]
[null,""]
[null,""]
[null,""]
[null,""]
[null,""]
[null,""]
[null,""]
[null,""]
[null,""]
[null,""]
[null,""]
[null,""]
[null,""]
[null,""]
[null,""]
[null,""]
[null,""]
[null,""]
[null,""]
[null,""]
[null,""]
[null,""]
[null,""]
[null,""]
[null,""]
[null,""]
[null,""]
[null,""]
[null,""]
[null,""]
[null,""]
[null,""]
[null,""]
[null,""]
[null,""]
[null,""]
[null,""]
[null,""]
[null,""]
[null,""]
[null,""]
[null,""]
[null,""]
[null,""]
[null,""]
[null,""]
[null,""]
[null,""]
[null,""]
[null,""]
[null,""]
[null,""]
[null,""]
[null,""]
[null,""]
[null,""]
[null,{"$f":"IF(ISERROR(VLOOKUP(A258,etab,2,FALSE)),\"\",VLOOKUP(A258,etab,2,FALSE))","v":""}]
[null,""]
[null,""]
[null,""]
[null,""]
[null,""]
[null,""]
[null,""]
[null,""]
[null,""]
[null,""]
[null,""]
[null,""]
[null,""]
[null,""]
[null,""]
[null,""]
[null,""]
[null,""]
[null,""]
[null,""]
[null,""]
[null,""]
[null,""]
[null,""]
[null,""]
[null,""]
[null,""]
[null,""]
[null,""]
[null,""]
[null,""]
[null,""]
[null,""]
[null,""]
[null,""]
[null,""]
[null,""]
[null,""]
[null,""]
[null,""]
[null,""]
[null,""]
[null,""]
[null,""]
[null,""]
[null,""]
[null,""]
[null,""]
[null,""]
[null,""]
[null,""]
[null,""]
[null,""]
[null,""]
[null,""]
[null,""]
[null,""]
[null,""]
[null,""]
[null,""]
[null,""]
[null,""]
[null,""]
[null,{"$f":"IF(ISERROR(VLOOKUP(A322,etab,2,FALSE)),\"\",VLOOKUP(A322,etab,2,FALSE))","v":""}]
[null,""]
[null,""]
[null,""]
[null,""]
[null,""]
[null,""]
[null,""]
[null,""]
[null,""]
[null,""]
[null,""]
[null,""]
[null,""]
[null,""]
[null,""]
[null,""]
[null,""]
[null,""]
[null,""]
[null,""]
[null,""]
[null,""]
[null,""]
[null,""]
[null,""]
[null,""]
[null,""]
[null,""]
[null,""]
[null,""]
[null,""]
[null,""]
[null,""]
[null,""]
[null,""]
[null,""]
[null,""]
[null,""]
[null,""]
[null,""]
[null,""]
[null,""]
[null,""]
[null,""]
[null,""]
[null,""]
[null,""]
[null,""]
[null,""]
[null,""]
[null,""]
[null,""]
[null,""]
[null,""]
[null,""]
[null,""]
[null,""]
[null,""]
[null,""]
[null,""]
[null,""]
[null,""]
[null,""]
[null,{"$f":"IF(ISERROR(VLOOKUP(A386,etab,2,FALSE)),\"\",VLOOKUP(A386,etab,2,FALSE))","v":""}]
[null,""]
[null,""]
[null,""]
[null,""]
[null,""]
[null,""]
[null,""]
[null,""]
[null,""]
[null,""]
[null,""]
[null,""]
[null,""]
[null,""]
[null,""]
[null,""]
[null,""]
[null,""]
[null,""]
[null,""]
[null,""]
[null,""]
[null,""]
[null,""]
[null,""]
[null,""]
[null,""]
[null,""]
[null,""]
[null,""]
[null,""]
[null,""]
[null,""]
[null,""]
[null,""]
[null,""]
[null,""]
[null,""]
[null,""]
[null,""]
[null,""]
[null,""]
[null,""]
[null,""]
[null,""]
[null,""]
[null,""]
[null,""]
[null,""]
[null,""]
[null,""]
[null,""]
[null,""]
[null,""]
[null,""]
[null,""]
[null,""]
[null,""]
[null,""]
[null,""]
[null,""]
[null,""]
[null,""]
[null,{"$f":"IF(ISERROR(VLOOKUP(A450,etab,2,FALSE)),\"\",VLOOKUP(A450,etab,2,FALSE))","v":""}]
[null,""]
[null,""]
[null,""]
[null,""]
[null,""]
[null,""]
[null,""]
[null,""]
[null,""]
[null,""]
[null,""]
[null,""]
[null,""]
[null,""]
[null,""]
[null,""]
[null,""]
[null,""]
[null,""]
[null,""]
[null,""]
[null,""]
[null,""]
[null,""]
[null,""]
[null,""]
[null,""]
[null,""]
[null,""]
[null,""]
[null,""]
[null,""]
[null,""]
[null,""]
[null,""]
[null,""]
[null,""]
[null,""]
[null,""]
[null,""]
[null,""]
[null,""]
[null,""]
[null,""]
[null,""]
[null,""]
[null,""]
[null,""]
[null,""]
[null,""]
[null,""]
[null,""]
[null,""]
[null,""]
[null,""]
[null,""]
[null,""]
[null,""]
[null,""]
[null,""]
[null,""]
[null,""]
[null,""]
[null,{"$f":"IF(ISERROR(VLOOKUP(A514,etab,2,FALSE)),\"\",VLOOKUP(A514,etab,2,FALSE))","v":""}]
[null,""]
[null,""]
[null,""]
[null,""]
[null,""]
[null,""]
[null,""]
[null,""]
[null,""]
[null,""]
[null,""]
[null,""]
[null,""]
[null,""]
[null,""]
[null,""]
[null,""]
[null,""]
[null,""]
[null,""]
[null,""]
[null,""]
[null,""]
[null,""]
[null,""]
[null,""]
[null,""]
[null,""]
[null,""]
[null,""]
[null,""]
[null,""]
[null,""]
[null,""]
[null,""]
[null,""]
[null,""]
[null,""]
[null,""]
[null,""]
[null,""]
[null,""]
[null,""]
[null,""]
[null,""]
[null,""]
[null,""]
[null,""]
[null,""]
[null,""]
[null,""]
[null,""]
[null,""]
[null,""]
[null,""]
[null,""]
[null,""]
[null,""]
[null,""]
[null,""]
[null,""]
[null,""]
[null,""]
[null,{"$f":"IF(ISERROR(VLOOKUP(A578,etab,2,FALSE)),\"\",VLOOKUP(A578,etab,2,FALSE))","v":""}]
[null,""]
[null,""]
[null,""]
[null,""]
[null,""]
[null,""]
[null,""]
[null,""]
[null,""]
[null,""]
[null,""]
[null,""]
[null,""]
[null,""]
[null,""]
[null,""]
[null,""]
[null,""]
[null,""]
[null,""]
[null,""]
[null,""]
[null,""]
[null,""]
[null,""]

{"sheet":"Données","index":1,"n_rows":600,"n_cols":13,"rows_kept":600,"cut":false,"hidden":false,"merged":[[7,11,7,12]]}
["Retour",{"$f":"COUNTA(A3:A601)&\" Établissements\"","v":"64 Établissements"},null,null,null,{"$f":"COUNTIF(E3:F601,1)","v":57},{"$f":"COUNTIF(F3:G601,\"Valide\")","v":0}]
["Code RNE","Nom établissement","Dpt, bassin, ville","Cat: public/privé","DATE RETOUR","RECU","VALIDE"]
["9830004M","CLG GEORGES BAUDOUX - NOUMEA","PROVINCE SUD","public",{"$f":"IF(ISERROR(VLOOKUP(A3,RETOUR,3,FALSE)),\"\",(VLOOKUP(A3,RETOUR,3,FALSE)))","v":"21-07-2014"},{"$f":"COUNTIF(RETOUR,A3)","v":1},{"$f":"IF(ISERROR(VLOOKUP(A3,RETOUR,5,FALSE)),\"\",VLOOKUP(A3,RETOUR,5,FALSE))","v":0}]
["9830356V","CLG DE MAGENTA ET SEGPA - NOUMEA","PROVINCE SUD","public","21-07-2014",{"$f":"COUNTIF(RETOUR,A4)","v":1},{"$f":"IF(ISERROR(VLOOKUP(A4,RETOUR,5,FALSE)),\"\",VLOOKUP(A4,RETOUR,5,FALSE))","v":0},"Sélectionner GEBEPS diffusé aux établissements",null,null,null,"GIBEPS_PROTOCOLES_2014.xlsm"]
["9830616C","CLG LOUISE MICHEL DE PAITA SUD - PAITA","PROVINCE SUD","public","21-07-2014",1,0,"GEBEPS2014_Excel.xls",null,null,"<-- nom du fichier"]
["9830656W","CLG DE PAITA NORD - PAITA","PROVINCE SUD","public","21-07-2014",1,0,"APSA"]
["9830524C","CLG DE KAMERE - NOUMEA","PROVINCE SUD","public","21-07-2014",1,0]
["9830277J","CLG JEAN MARIOTTI - NOUMEA","PROVINCE SUD","public","21-07-2014",1,0,"Demi-fond","CP1","N",null,"Paramétrage"]
["9830625M","CLG PORTES DE FER ET SEGPA - NOUMEA","PROVINCE SUD","public","21-07-2014",1,0,"Haies","CP1","N",null,"Académie","Académie de Nouvelle-Calédonie"]
["9830304N","CLG DE RIVIERE SALEE - NOUMEA","PROVINCE SUD","public","21-07-2014",1,0,"Hauteur","CP1","N",null,"Session",2014]
["9830649N","CLG ALAIN MERMOUD TUBAND - NOUMEA","PROVINCE SUD","public","21-07-2014",1,0,"Javelot","CP1","N",null,"Version","V3_29/10/13"]
["9830640D","CLG EDMEE VARIN AUTEUIL ET SEGPA - NOUMEA","PROVINCE SUD","public","21-07-2014",1,0,"Multibond","CP1","N"]
["9830626N","CLG JEAN FAYARD - KATIRAMONA","PROVINCE SUD","public","21-07-2014",1,0,"Relais-vitesse","CP1","N"]
["9830474Y","CLG FRANCIS CARCO ET SEGPA - KOUTIO","PROVINCE SUD","public","21-07-2014",1,0,"Natation longue","CP1","N",null,null,"OUTILS"]
["9830384A","CLG DE BOULARI ET SEGPA","PROVINCE SUD","public","21-07-2014",1,0,"Natation vitesse","CP1","N"]
["9830538T","CLG DE NORMANDIE ET SEGPA","PROVINCE SUD","public","21-07-2014",1,0,"Canoë-Kayak","CP2","N"]
["9830624L","CLG DE PLUM","PROVINCE SUD","public","21-07-2014",1,0,"CO","CP2","N"]
["9830009T","CLG DE LA FOA","PROVINCE SUD","public","21-07-2014",1,0,"Escalade","CP2","N"]
["9830477B","CLG DE YATE","PROVINCE SUD","public","21-07-2014",1,0,"Aérobic","CP3","N"]
["9830010U","CLG LOUIS LEOPOLD DJIET ET SEGPA - BOURAIL","PROVINCE SUD","public","21-07-2014",1,0,"Acrosport","CP3","N"]
["9830355U","CLG DE THIO","PROVINCE SUD","public","21-07-2014",1,0,"Gymnastique sportive","CP3","N"]
["9830493U","CLG DE POYA","PROVINCE NORD","public","21-07-2014",1,0,"Gymnastique rythmique","CP3","N"]
["9830278K","CLG DE KONE","PROVINCE NORD","public","21-07-2014",1,0,"Arts du cirque","CP3","N"]
["9830007R","CLG DE KOUMAC ET SEGPA","PROVINCE NORD","public","21-07-2014",1,0,"Danse","CP3","N"]
["9830419N","CLG DE CANALA ET SEGPA","PROVINCE NORD","public","21-07-2014",1,0,"Basket","CP4","N"]
["9830418M","CLG DE WANI ET SEGPA  - HOUAILOU","PROVINCE NORD","public","21-07-2014",1,0,"Foot","CP4","N"]
["9830008S","CLG RAYMOND VAUTHIER ET SEGPA - POINDIMIE","PROVINCE NORD","public","21-07-2014",1,0,"Hand","CP4","N"]
["9830522A","CLG PAI-KALEONE - HIENGHENE","PROVINCE NORD","public","21-07-2014",1,0,"Rugby","CP4","N"]
["9830632V","CLG DE OUEGOA","PROVINCE NORD","public","21-07-2014",1,0,"Volley","CP4","N"]
["9830357W","CLG LAURA BOULA ET SEGPA - WE LIFOU","PROVINCE DES ILES","public","21-07-2014",1,0,"Lutte","CP4","N"]
["9830482G","CLG LA ROCHE ET SEGPA - MARE","PROVINCE DES ILES","public","21-07-2014",1,0,"Boxe Française","CP4","N"]
["9830414H","CLG TADINE - MARE","PROVINCE DES ILES","public","21-07-2014",1,0,"Badminton","CP4","N"]
["9830639C","CLG OUVEA ET SEGPA","PROVINCE DES ILES","public","21-07-2014",1,0,"Tennis de table","CP4","N"]
["9830492T","GOD KOUAOUA","PROVINCE NORD","public","21-07-2014",1,0,"Va'a","CP2","A"]
["9830516U","ALP LA ROCHE MARE","PROVINCE DES ILES","public","",0,"","Planche à voile","CP2","A"]
["VANUATU","CLG LE CLEZIO VANUATU","VANUATU","public","21-07-2014",1,0,"Voile","CP2","A"]
["9830508K","ALP VALLEE DU TIR","PROVINCE SUD","public","21-07-2014",1,0,"Ultimate","CP4","A"]
["9830681Y","CLG DUMBEA SUR MER","PROVINCE SUD","public","21-07-2014",1,0,null,null,"A"]
["9830259P","CLG CHAMPAGNAT - NOUMEA","PROVINCE SUD","privé","21-07-2014",1,0,null,null,"A"]
["9830260R","CLG SAINT JOSEPH DE CLUNY - NOUMEA","PROVINCE SUD","privé","21-07-2014",1,0,null,null,"A"]
["9830263U","CLG MARIE REINE THABOR - MONT DORE","PROVINCE SUD","privé","21-07-2014",1,0,null,null,"A"]
["9830264V","CLG SAINTE MARIE - PAITA","PROVINCE SUD","privé","21-07-2014",1,0,null,null,"A"]
["9830381X","CLG SAINT DOMINIQUE SAVIO - LA FOA","PROVINCE SUD","privé","21-07-2014",1,0]
["9830265W","CLG SACRE CŒUR - BOURAIL","PROVINCE SUD","privé","21-07-2014",1,0]
["9830298G","CLG FRANCIS ROUGE - THIO","PROVINCE NORD","privé","21-07-2014",1,0]
["9830354T","CLG SAINT JOSEPH - VAO ILES DES PINS","PROVINCE DES ILES","privé","21-07-2014",1,0,"GEBEPS pour déprotéger cette feuille"]
["9830266X","CLG GUILLAUME DOUARRE - OUVEA","PROVINCE DES ILES","privé","21-07-2014",1,0]
["9830400T","CLG DE NATHALO - LIFOU","PROVINCE DES ILES","privé","21-07-2014",1,0]
["9830297F","CLG HIPPOLYTE BONOU - POUEBO","PROVINCE NORD","privé","21-07-2014",1,0]
["9830313Y","CLG YVES MARIE HILY - PONERIHOUEN","PROVINCE NORD","privé","",0,""]
["9830382Y","CLG J.B. VIGOUROUX - POINDIMIE","PROVINCE NORD","privé","21-07-2014",1,0]
["9830431B","CLG BAGANDA - KAALA GOMEN","PROVINCE NORD","privé","",0,""]
["9830518W","CLG BOUAVA KALEBA - POUM","PROVINCE NORD","privé","21-07-2014",1,0]
["9830267Y","CLG DO NEVA - HOUAILOU","PROVINCE NORD","privé","21-07-2014",1,0]
["9830609V","CLG GELIMA - CANALA","PROVINCE NORD","privé","21-07-2014",1,0]
["9830447U","CLG EBEN EZA - OUVEA","PROVINCE DES ILES","privé","21-07-2014",1,0]
["9830295D","CLG HAVILA - LIFOU","PROVINCE DES ILES","privé","21-07-2014",1,0]
["9830392J","CLG TAREMEN - MARE","PROVINCE DES ILES","privé","21-07-2014",1,0]
["9830420P","CLG HNAIZIANU - LIFOU","PROVINCE DES ILES","privé","21-07-2014",1,0]
["9830268Z","CLG NEDIVIN - HOUAILOU","PROVINCE NORD","privé","",0,""]
["9830472W","CLG DE MOU - PONERIHOUEN","PROVINCE NORD","privé","",0,""]
["9830432C","CLG TIETA - VOH","PROVINCE NORD","privé","21-07-2014",1,0]
["9830672N","CLG JAMES COOK","PROVINCE SUD","privé","",0,""]
["9830270B","LP JEAN 23","PROVINCE SUD","privé","21-07-2014",1,0]
["9830537S","Lycée agricole DO NEVA","PROVINCE NORD","privé","",0,""]
["9830271C","LP CHAMPAGNAT","PROVINCE SUD","privé","21-07-2014",1,0]
[null,null,null,null,{"$f":"IF(ISERROR(VLOOKUP(A67,RETOUR,3,FALSE)),\"\",(VLOOKUP(A67,RETOUR,3,FALSE)))","v":""},{"$f":"COUNTIF(RETOUR,A67)","v":0},{"$f":"IF(ISERROR(VLOOKUP(A67,RETOUR,5,FALSE)),\"\",VLOOKUP(A67,RETOUR,5,FALSE))","v":""}]
[null,null,null,null,"",0,""]
[null,null,null,null,"",0,""]
[null,null,null,null,"",0,""]
[null,null,null,null,"",0,""]
[null,null,null,null,"",0,""]
[null,null,null,null,"",0,""]
[null,null,null,null,"",0,""]
[null,null,null,null,"",0,""]
[null,null,null,null,"",0,""]
[null,null,null,null,"",0,""]
[null,null,null,null,"",0,""]
[null,null,null,null,"",0,""]
[null,null,null,null,"",0,""]
[null,null,null,null,"",0,""]
[null,null,null,null,"",0,""]
[null,null,null,null,"",0,""]
[null,null,null,null,"",0,""]
[null,null,null,null,"",0,""]
[null,null,null,null,"",0,""]
[null,null,null,null,"",0,""]
[null,null,null,null,"",0,""]
[null,null,null,null,"",0,""]
[null,null,null,null,"",0,""]
[null,null,null,null,"",0,""]
[null,null,null,null,"",0,""]
[null,null,null,null,"",0,""]
[null,null,null,null,"",0,""]
[null,null,null,null,"",0,""]
[null,null,null,null,"",0,""]
[null,null,null,null,"",0,""]
[null,null,null,null,"",0,""]
[null,null,null,null,"",0,""]
[null,null,null,null,"",0,""]
[null,null,null,null,"",0,""]
[null,null,null,null,"",0,""]
[null,null,null,null,"",0,""]
[null,null,null,null,"",0,""]
[null,null,null,null,"",0,""]
[null,null,null,null,"",0,""]
[null,null,null,null,"",0,""]
[null,null,null,null,"",0,""]
[null,null,null,null,"",0,""]
[null,null,null,null,"",0,""]
[null,null,null,null,"",0,""]
[null,null,null,null,"",0,""]
[null,null,null,null,"",0,""]
[null,null,null,null,"",0,""]
[null,null,null,null,"",0,""]
[null,null,null,null,"",0,""]
[null,null,null,null,"",0,""]
[null,null,null,null,"",0,""]
[null,null,null,null,"",0,""]
[null,null,null,null,"",0,""]
[null,null,null,null,"",0,""]
[null,null,null,null,"",0,""]
[null,null,null,null,"",0,""]
[null,null,null,null,"",0,""]
[null,null,null,null,"",0,""]
[null,null,null,null,"",0,""]
[null,null,null,null,"",0,""]
[null,null,null,null,"",0,""]
[null,null,null,null,"",0,""]
[null,null,null,null,"",0,""]
[null,null,null,null,{"$f":"IF(ISERROR(VLOOKUP(A131,RETOUR,3,FALSE)),\"\",(VLOOKUP(A131,RETOUR,3,FALSE)))","v":""},{"$f":"COUNTIF(RETOUR,A131)","v":0},{"$f":"IF(ISERROR(VLOOKUP(A131,RETOUR,5,FALSE)),\"\",VLOOKUP(A131,RETOUR,5,FALSE))","v":""}]
[null,null,null,null,"",0,""]
[null,null,null,null,"",0,""]
[null,null,null,null,"",0,""]
[null,null,null,null,"",0,""]
[null,null,null,null,"",0,""]
[null,null,null,null,"",0,""]
[null,null,null,null,"",0,""]
[null,null,null,null,"",0,""]
[null,null,null,null,"",0,""]
[null,null,null,null,"",0,""]
[null,null,null,null,"",0,""]
[null,null,null,null,"",0,""]
[null,null,null,null,"",0,""]
[null,null,null,null,"",0,""]
[null,null,null,null,"",0,""]
[null,null,null,null,"",0,""]
[null,null,null,null,"",0,""]
[null,null,null,null,"",0,""]
[null,null,null,null,"",0,""]
[null,null,null,null,"",0,""]
[null,null,null,null,"",0,""]
[null,null,null,null,"",0,""]
[null,null,null,null,"",0,""]
[null,null,null,null,"",0,""]
[null,null,null,null,"",0,""]
[null,null,null,null,"",0,""]
[null,null,null,null,"",0,""]
[null,null,null,null,"",0,""]
[null,null,null,null,"",0,""]
[null,null,null,null,"",0,""]
[null,null,null,null,"",0,""]
[null,null,null,null,"",0,""]
[null,null,null,null,"",0,""]
[null,null,null,null,"",0,""]
[null,null,null,null,"",0,""]
[null,null,null,null,"",0,""]
[null,null,null,null,"",0,""]
[null,null,null,null,"",0,""]
[null,null,null,null,"",0,""]
[null,null,null,null,"",0,""]
[null,null,null,null,"",0,""]
[null,null,null,null,"",0,""]
[null,null,null,null,"",0,""]
[null,null,null,null,"",0,""]
[null,null,null,null,"",0,""]
[null,null,null,null,"",0,""]
[null,null,null,null,"",0,""]
[null,null,null,null,"",0,""]
[null,null,null,null,"",0,""]
[null,null,null,null,"",0,""]
[null,null,null,null,"",0,""]
[null,null,null,null,"",0,""]
[null,null,null,null,"",0,""]
[null,null,null,null,"",0,""]
[null,null,null,null,"",0,""]
[null,null,null,null,"",0,""]
[null,null,null,null,"",0,""]
[null,null,null,null,"",0,""]
[null,null,null,null,"",0,""]
[null,null,null,null,"",0,""]
[null,null,null,null,"",0,""]
[null,null,null,null,"",0,""]
[null,null,null,null,"",0,""]
[null,null,null,null,{"$f":"IF(ISERROR(VLOOKUP(A195,RETOUR,3,FALSE)),\"\",(VLOOKUP(A195,RETOUR,3,FALSE)))","v":""},{"$f":"COUNTIF(RETOUR,A195)","v":0},{"$f":"IF(ISERROR(VLOOKUP(A195,RETOUR,5,FALSE)),\"\",VLOOKUP(A195,RETOUR,5,FALSE))","v":""}]
[null,null,null,null,"",0,""]
[null,null,null,null,"",0,""]
[null,null,null,null,"",0,""]
[null,null,null,null,"",0,""]
[null,null,null,null,"",0,""]
[null,null,null,null,"",0,""]
[null,null,null,null,"",0,""]
[null,null,null,null,"",0,""]
[null,null,null,null,"",0,""]
[null,null,null,null,"",0,""]
[null,null,null,null,"",0,""]
[null,null,null,null,"",0,""]
[null,null,null,null,"",0,""]
[null,null,null,null,"",0,""]
[null,null,null,null,"",0,""]
[null,null,null,null,"",0,""]
[null,null,null,null,"",0,""]
[null,null,null,null,"",0,""]
[null,null,null,null,"",0,""]
[null,null,null,null,"",0,""]
[null,null,null,null,"",0,""]
[null,null,null,null,"",0,""]
[null,null,null,null,"",0,""]
[null,null,null,null,"",0,""]
[null,null,null,null,"",0,""]
[null,null,null,null,"",0,""]
[null,null,null,null,"",0,""]
[null,null,null,null,"",0,""]
[null,null,null,null,"",0,""]
[null,null,null,null,"",0,""]
[null,null,null,null,"",0,""]
[null,null,null,null,"",0,""]
[null,null,null,null,"",0,""]
[null,null,null,null,"",0,""]
[null,null,null,null,"",0,""]
[null,null,null,null,"",0,""]
[null,null,null,null,"",0,""]
[null,null,null,null,"",0,""]
[null,null,null,null,"",0,""]
[null,null,null,null,"",0,""]
[null,null,null,null,"",0,""]
[null,null,null,null,"",0,""]
[null,null,null,null,"",0,""]
[null,null,null,null,"",0,""]
[null,null,null,null,"",0,""]
[null,null,null,null,"",0,""]
[null,null,null,null,"",0,""]
[null,null,null,null,"",0,""]
[null,null,null,null,"",0,""]
[null,null,null,null,"",0,""]
[null,null,null,null,"",0,""]
[null,null,null,null,"",0,""]
[null,null,null,null,"",0,""]
[null,null,null,null,"",0,""]
[null,null,null,null,"",0,""]
[null,null,null,null,"",0,""]
[null,null,null,null,"",0,""]
[null,null,null,null,"",0,""]
[null,null,null,null,"",0,""]
[null,null,null,null,"",0,""]
[null,null,null,null,"",0,""]
[null,null,null,null,"",0,""]
[null,null,null,null,"",0,""]
[null,null,null,null,{"$f":"IF(ISERROR(VLOOKUP(A259,RETOUR,3,FALSE)),\"\",(VLOOKUP(A259,RETOUR,3,FALSE)))","v":""},{"$f":"COUNTIF(RETOUR,A259)","v":0},{"$f":"IF(ISERROR(VLOOKUP(A259,RETOUR,5,FALSE)),\"\",VLOOKUP(A259,RETOUR,5,FALSE))","v":""}]
[null,null,null,null,"",0,""]
[null,null,null,null,"",0,""]
[null,null,null,null,"",0,""]
[null,null,null,null,"",0,""]
[null,null,null,null,"",0,""]
[null,null,null,null,"",0,""]
[null,null,null,null,"",0,""]
[null,null,null,null,"",0,""]
[null,null,null,null,"",0,""]
[null,null,null,null,"",0,""]
[null,null,null,null,"",0,""]
[null,null,null,null,"",0,""]
[null,null,null,null,"",0,""]
[null,null,null,null,"",0,""]
[null,null,null,null,"",0,""]
[null,null,null,null,"",0,""]
[null,null,null,null,"",0,""]
[null,null,null,null,"",0,""]
[null,null,null,null,"",0,""]
[null,null,null,null,"",0,""]
[null,null,null,null,"",0,""]
[null,null,null,null,"",0,""]
[null,null,null,null,"",0,""]
[null,null,null,null,"",0,""]
[null,null,null,null,"",0,""]
[null,null,null,null,"",0,""]
[null,null,null,null,"",0,""]
[null,null,null,null,"",0,""]
[null,null,null,null,"",0,""]
[null,null,null,null,"",0,""]
[null,null,null,null,"",0,""]
[null,null,null,null,"",0,""]
[null,null,null,null,"",0,""]
[null,null,null,null,"",0,""]
[null,null,null,null,"",0,""]
[null,null,null,null,"",0,""]
[null,null,null,null,"",0,""]
[null,null,null,null,"",0,""]
[null,null,null,null,"",0,""]
[null,null,null,null,"",0,""]
[null,null,null,null,"",0,""]
[null,null,null,null,"",0,""]
[null,null,null,null,"",0,""]
[null,null,null,null,"",0,""]
[null,null,null,null,"",0,""]
[null,null,null,null,"",0,""]
[null,null,null,null,"",0,""]
[null,null,null,null,"",0,""]
[null,null,null,null,"",0,""]
[null,null,null,null,"",0,""]
[null,null,null,null,"",0,""]
[null,null,null,null,"",0,""]
[null,null,null,null,"",0,""]
[null,null,null,null,"",0,""]
[null,null,null,null,"",0,""]
[null,null,null,null,"",0,""]
[null,null,null,null,"",0,""]
[null,null,null,null,"",0,""]
[null,null,null,null,"",0,""]
[null,null,null,null,"",0,""]
[null,null,null,null,"",0,""]
[null,null,null,null,"",0,""]
[null,null,null,null,"",0,""]
[null,null,null,null,{"$f":"IF(ISERROR(VLOOKUP(A323,RETOUR,3,FALSE)),\"\",(VLOOKUP(A323,RETOUR,3,FALSE)))","v":""},{"$f":"COUNTIF(RETOUR,A323)","v":0},{"$f":"IF(ISERROR(VLOOKUP(A323,RETOUR,5,FALSE)),\"\",VLOOKUP(A323,RETOUR,5,FALSE))","v":""}]
[null,null,null,null,"",0,""]
[null,null,null,null,"",0,""]
[null,null,null,null,"",0,""]
[null,null,null,null,"",0,""]
[null,null,null,null,"",0,""]
[null,null,null,null,"",0,""]
[null,null,null,null,"",0,""]
[null,null,null,null,"",0,""]
[null,null,null,null,"",0,""]
[null,null,null,null,"",0,""]
[null,null,null,null,"",0,""]
[null,null,null,null,"",0,""]
[null,null,null,null,"",0,""]
[null,null,null,null,"",0,""]
[null,null,null,null,"",0,""]
[null,null,null,null,"",0,""]
[null,null,null,null,"",0,""]
[null,null,null,null,"",0,""]
[null,null,null,null,"",0,""]
[null,null,null,null,"",0,""]
[null,null,null,null,"",0,""]
[null,null,null,null,"",0,""]
[null,null,null,null,"",0,""]
[null,null,null,null,"",0,""]
[null,null,null,null,"",0,""]
[null,null,null,null,"",0,""]
[null,null,null,null,"",0,""]
[null,null,null,null,"",0,""]
[null,null,null,null,"",0,""]
[null,null,null,null,"",0,""]
[null,null,null,null,"",0,""]
[null,null,null,null,"",0,""]
[null,null,null,null,"",0,""]
[null,null,null,null,"",0,""]
[null,null,null,null,"",0,""]
[null,null,null,null,"",0,""]
[null,null,null,null,"",0,""]
[null,null,null,null,"",0,""]
[null,null,null,null,"",0,""]
[null,null,null,null,"",0,""]
[null,null,null,null,"",0,""]
[null,null,null,null,"",0,""]
[null,null,null,null,"",0,""]
[null,null,null,null,"",0,""]
[null,null,null,null,"",0,""]
[null,null,null,null,"",0,""]
[null,null,null,null,"",0,""]
[null,null,null,null,"",0,""]
[null,null,null,null,"",0,""]
[null,null,null,null,"",0,""]
[null,null,null,null,"",0,""]
[null,null,null,null,"",0,""]
[null,null,null,null,"",0,""]
[null,null,null,null,"",0,""]
[null,null,null,null,"",0,""]
[null,null,null,null,"",0,""]
[null,null,null,null,"",0,""]
[null,null,null,null,"",0,""]
[null,null,null,null,"",0,""]
[null,null,null,null,"",0,""]
[null,null,null,null,"",0,""]
[null,null,null,null,"",0,""]
[null,null,null,null,"",0,""]
[null,null,null,null,{"$f":"IF(ISERROR(VLOOKUP(A387,RETOUR,3,FALSE)),\"\",(VLOOKUP(A387,RETOUR,3,FALSE)))","v":""},{"$f":"COUNTIF(RETOUR,A387)","v":0},{"$f":"IF(ISERROR(VLOOKUP(A387,RETOUR,5,FALSE)),\"\",VLOOKUP(A387,RETOUR,5,FALSE))","v":""}]
[null,null,null,null,"",0,""]
[null,null,null,null,"",0,""]
[null,null,null,null,"",0,""]
[null,null,null,null,"",0,""]
[null,null,null,null,"",0,""]
[null,null,null,null,"",0,""]
[null,null,null,null,"",0,""]
[null,null,null,null,"",0,""]
[null,null,null,null,"",0,""]
[null,null,null,null,"",0,""]
[null,null,null,null,"",0,""]
[null,null,null,null,"",0,""]
[null,null,null,null,"",0,""]
[null,null,null,null,"",0,""]
[null,null,null,null,"",0,""]
[null,null,null,null,"",0,""]
[null,null,null,null,"",0,""]
[null,null,null,null,"",0,""]
[null,null,null,null,"",0,""]
[null,null,null,null,"",0,""]
[null,null,null,null,"",0,""]
[null,null,null,null,"",0,""]
[null,null,null,null,"",0,""]
[null,null,null,null,"",0,""]
[null,null,null,null,"",0,""]
[null,null,null,null,"",0,""]
[null,null,null,null,"",0,""]
[null,null,null,null,"",0,""]
[null,null,null,null,"",0,""]
[null,null,null,null,"",0,""]
[null,null,null,null,"",0,""]
[null,null,null,null,"",0,""]
[null,null,null,null,"",0,""]
[null,null,null,null,"",0,""]
[null,null,null,null,"",0,""]
[null,null,null,null,"",0,""]
[null,null,null,null,"",0,""]
[null,null,null,null,"",0,""]
[null,null,null,null,"",0,""]
[null,null,null,null,"",0,""]
[null,null,null,null,"",0,""]
[null,null,null,null,"",0,""]
[null,null,null,null,"",0,""]
[null,null,null,null,"",0,""]
[null,null,null,null,"",0,""]
[null,null,null,null,"",0,""]
[null,null,null,null,"",0,""]
[null,null,null,null,"",0,""]
[null,null,null,null,"",0,""]
[null,null,null,null,"",0,""]
[null,null,null,null,"",0,""]
[null,null,null,null,"",0,""]
[null,null,null,null,"",0,""]
[null,null,null,null,"",0,""]
[null,null,null,null,"",0,""]
[null,null,null,null,"",0,""]
[null,null,null,null,"",0,""]
[null,null,null,null,"",0,""]
[null,null,null,null,"",0,""]
[null,null,null,null,"",0,""]
[null,null,null,null,"",0,""]
[null,null,null,null,"",0,""]
[null,null,null,null,"",0,""]
[null,null,null,null,{"$f":"IF(ISERROR(VLOOKUP(A451,RETOUR,3,FALSE)),\"\",(VLOOKUP(A451,RETOUR,3,FALSE)))","v":""},{"$f":"COUNTIF(RETOUR,A451)","v":0},{"$f":"IF(ISERROR(VLOOKUP(A451,RETOUR,5,FALSE)),\"\",VLOOKUP(A451,RETOUR,5,FALSE))","v":""}]
[null,null,null,null,"",0,""]
[null,null,null,null,"",0,""]
[null,null,null,null,"",0,""]
[null,null,null,null,"",0,""]
[null,null,null,null,"",0,""]
[null,null,null,null,"",0,""]
[null,null,null,null,"",0,""]
[null,null,null,null,"",0,""]
[null,null,null,null,"",0,""]
[null,null,null,null,"",0,""]
[null,null,null,null,"",0,""]
[null,null,null,null,"",0,""]
[null,null,null,null,"",0,""]
[null,null,null,null,"",0,""]
[null,null,null,null,"",0,""]
[null,null,null,null,"",0,""]
[null,null,null,null,"",0,""]
[null,null,null,null,"",0,""]
[null,null,null,null,"",0,""]
[null,null,null,null,"",0,""]
[null,null,null,null,"",0,""]
[null,null,null,null,"",0,""]
[null,null,null,null,"",0,""]
[null,null,null,null,"",0,""]
[null,null,null,null,"",0,""]
[null,null,null,null,"",0,""]
[null,null,null,null,"",0,""]
[null,null,null,null,"",0,""]
[null,null,null,null,"",0,""]
[null,null,null,null,"",0,""]
[null,null,null,null,"",0,""]
[null,null,null,null,"",0,""]
[null,null,null,null,"",0,""]
[null,null,null,null,"",0,""]
[null,null,null,null,"",0,""]
[null,null,null,null,"",0,""]
[null,null,null,null,"",0,""]
[null,null,null,null,"",0,""]
[null,null,null,null,"",0,""]
[null,null,null,null,"",0,""]
[null,null,null,null,"",0,""]
[null,null,null,null,"",0,""]
[null,null,null,null,"",0,""]
[null,null,null,null,"",0,""]
[null,null,null,null,"",0,""]
[null,null,null,null,"",0,""]
[null,null,null,null,"",0,""]
[null,null,null,null,"",0,""]
[null,null,null,null,"",0,""]
[null,null,null,null,"",0,""]
[null,null,null,null,"",0,""]
[null,null,null,null,"",0,""]
[null,null,null,null,"",0,""]
[null,null,null,null,"",0,""]
[null,null,null,null,"",0,""]
[null,null,null,null,"",0,""]
[null,null,null,null,"",0,""]
[null,null,null,null,"",0,""]
[null,null,null,null,"",0,""]
[null,null,null,null,"",0,""]
[null,null,null,null,"",0,""]
[null,null,null,null,"",0,""]
[null,null,null,null,"",0,""]
[null,null,null,null,{"$f":"IF(ISERROR(VLOOKUP(A515,RETOUR,3,FALSE)),\"\",(VLOOKUP(A515,RETOUR,3,FALSE)))","v":""},{"$f":"COUNTIF(RETOUR,A515)","v":0},{"$f":"IF(ISERROR(VLOOKUP(A515,RETOUR,5,FALSE)),\"\",VLOOKUP(A515,RETOUR,5,FALSE))","v":""}]
[null,null,null,null,"",0,""]
[null,null,null,null,"",0,""]
[null,null,null,null,"",0,""]
[null,null,null,null,"",0,""]
[null,null,null,null,"",0,""]
[null,null,null,null,"",0,""]
[null,null,null,null,"",0,""]
[null,null,null,null,"",0,""]
[null,null,null,null,"",0,""]
[null,null,null,null,"",0,""]
[null,null,null,null,"",0,""]
[null,null,null,null,"",0,""]
[null,null,null,null,"",0,""]
[null,null,null,null,"",0,""]
[null,null,null,null,"",0,""]
[null,null,null,null,"",0,""]
[null,null,null,null,"",0,""]
[null,null,null,null,"",0,""]
[null,null,null,null,"",0,""]
[null,null,null,null,"",0,""]
[null,null,null,null,"",0,""]
[null,null,null,null,"",0,""]
[null,null,null,null,"",0,""]
[null,null,null,null,"",0,""]
[null,null,null,null,"",0,""]
[null,null,null,null,"",0,""]
[null,null,null,null,"",0,""]
[null,null,null,null,"",0,""]
[null,null,null,null,"",0,""]
[null,null,null,null,"",0,""]
[null,null,null,null,"",0,""]
[null,null,null,null,"",0,""]
[null,null,null,null,"",0,""]
[null,null,null,null,"",0,""]
[null,null,null,null,"",0,""]
[null,null,null,null,"",0,""]
[null,null,null,null,"",0,""]
[null,null,null,null,"",0,""]
[null,null,null,null,"",0,""]
[null,null,null,null,"",0,""]
[null,null,null,null,"",0,""]
[null,null,null,null,"",0,""]
[null,null,null,null,"",0,""]
[null,null,null,null,"",0,""]
[null,null,null,null,"",0,""]
[null,null,null,null,"",0,""]
[null,null,null,null,"",0,""]
[null,null,null,null,"",0,""]
[null,null,null,null,"",0,""]
[null,null,null,null,"",0,""]
[null,null,null,null,"",0,""]
[null,null,null,null,"",0,""]
[null,null,null,null,"",0,""]
[null,null,null,null,"",0,""]
[null,null,null,null,"",0,""]
[null,null,null,null,"",0,""]
[null,null,null,null,"",0,""]
[null,null,null,null,"",0,""]
[null,null,null,null,"",0,""]
[null,null,null,null,"",0,""]
[null,null,null,null,"",0,""]
[null,null,null,null,"",0,""]
[null,null,null,null,"",0,""]
[null,null,null,null,{"$f":"IF(ISERROR(VLOOKUP(A579,RETOUR,3,FALSE)),\"\",(VLOOKUP(A579,RETOUR,3,FALSE)))","v":""},{"$f":"COUNTIF(RETOUR,A579)","v":0},{"$f":"IF(ISERROR(VLOOKUP(A579,RETOUR,5,FALSE)),\"\",VLOOKUP(A579,RETOUR,5,FALSE))","v":""}]
[null,null,null,null,"",0,""]
[null,null,null,null,"",0,""]
[null,null,null,null,"",0,""]
[null,null,null,null,"",0,""]
[null,null,null,null,"",0,""]
[null,null,null,null,"",0,""]
[null,null,null,null,"",0,""]
[null,null,null,null,"",0,""]
[null,null,null,null,"",0,""]
[null,null,null,null,"",0,""]
[null,null,null,null,"",0,""]
[null,null,null,null,"",0,""]
[null,null,null,null,"",0,""]
[null,null,null,null,"",0,""]
[null,null,null,null,"",0,""]
[null,null,null,null,"",0,""]
[null,null,null,null,"",0,""]
[null,null,null,null,"",0,""]
[null,null,null,null,"",0,""]
[null,null,null,null,"",0,""]
[null,null,null,null,"",0,""]

{"sheet":"Aide","index":2,"n_rows":38,"n_cols":2,"rows_kept":38,"cut":false,"hidden":false,"merged":[]}
["RETOUR",{"$f":"Données!M9","v":"Académie de Nouvelle-Calédonie"}]
[null,"Gestion Établissement du Brevet en EPS"]
[null,{"$f":"\"Session \"&Données!M10","v":"Session 2014"}]
[null,"Récupération des PROTOCOLES"]
[null,{"$f":"Données!M11","v":"V3_29/10/13"}]
[null,"Ce fichier vous permet de fusionner tous les protocoles que vous avez reçus des établissements"]
[]
[null,"PARAMÉTRAGES de GIBEPS"]
[null,"Vous devez au préalable ajouter les listes des établissements et des APSA par copier coller dans les cellules"]
[null,"jaunes. Si rien n'a été modifié par rapport à l'an dernier vous pouvez intégrer les données de votre ancien"]
[null," fichier GEBEPS en cliquant sur le bouton blanc  -->"]
[null,"lien vers liste établissements"]
[]
[null,"LA PROCÉDURE"]
[null,"Sur la page Reception"]
[null,"1 Avec le bouton 1, choisir le chemin du dossier où vous avez déposé les retours des établissements"]
[null,"Votre choix apparaitra dans un cellule vérifiez bien que cela soit le bon "]
[]
[null,"2 Avec le bouton 2,  Lancer l'importation"]
[]
[null,"3 Validation des protocoles"]
[null,"A gauche la liste des fichiers retenus avec un lien hypertexte qui pointe sur le protocole de l'établissement."]
[]
[null,"NAVIGATION"]
[null,"Après étude de la validité des protocoles sur chaque feuille établissement, vous pourrez revenir sur la page"]
[null," 'Reception' en faisant un DOUBLE CLIC en A1."]
[]
[null,"VALIDATION"]
[null,"En colonne C, en face de chaque établissement ,  selectionnez Valide ou Non valide dans le liste déroulante."]
[]
[null,"BILAN DES RETOURS"]
[null,"Sur le lien Tableau des retours, vous trouverez le pointage des remontées."]
[]
[null,"STATISTIQUES"]
[null,"Une fois que tous les protocoles des établissements sont rentrés, une page de statistiques donne un aperçu"]
[null,"des APSA proposées au DNB dans les établissements de votre académie."]
[null,"Nouveauté 2014 : nombre d'APSA proposées au DNB par établissement et le nombre d'APSA évaluées par"]
[null," classe pour chaque établissement. "]

{"sheet":"Stats APSA proposées","index":3,"n_rows":601,"n_cols":46,"rows_kept":601,"cut":false,"hidden":false,"merged":[[27,6,35,6],[27,5,35,5],[18,5,26,5],[18,6,26,6],[12,5,17,5],[12,6,17,6],[1,5,8,5],[1,6,8,6],[9,5,11,5],[9,6,11,6]]}
["APSA",null,"Nbre\nétablissements\nproposant\nl'APSA","% établ\nproposant \nl'APSA","% / ensemble APSA","Nbre APSA\n/ CP","Répartition / CP","R","Etabl./APSA","Nbre APSA\n/ établisst","Nbre APSA\n/ Classe","Demi-fond","Haies","Hauteur","Javelot","Multibond","Relais-vitesse","Natation longue","Natation vitesse","Canoë-Kayak","CO","Escalade","Aérobic","Acrosport","Gymnastique sportive","Gymnastique rythmique","Arts du cirque","Danse","Basket","Foot","Hand","Rugby","Volley","Lutte","Boxe Française","Badminton","Tennis de table",{"$f":"IF(Données!H34=\"\",\"\",Données!H34)","v":"Va'a"},{"$f":"IF(Données!H35=\"\",\"\",Données!H35)","v":"Planche à voile"},{"$f":"IF(Données!H36=\"\",\"\",Données!H36)","v":"Voile"},{"$f":"IF(Données!H37=\"\",\"\",Données!H37)","v":"Ultimate"},{"$f":"IF(Données!H38=\"\",\"\",Données!H38)","v":""},{"$f":"IF(Données!H39=\"\",\"\",Données!H39)","v":""},{"$f":"IF(Données!H40=\"\",\"\",Données!H40)","v":""},{"$f":"IF(Données!H41=\"\",\"\",Données!H41)","v":""},{"$f":"IF(Données!H42=\"\",\"\",Données!H42)","v":""}]
["Demi-fond","CP1",{"$f":"L$601","v":22},{"$f":"IF(ISERROR(C2/(COUNTIF(J$2:J$600,\">0\"))),\"\",C2/(COUNTIF(J$2:J$600,\">0\")))","v":0.38596491228070173},{"$f":"IF(ISERROR(C2/SUM(C$2:C$36)),\"\",C2/SUM(C$2:C$36))","v":9.90990990990991E-2},{"$f":"SUMIF(B$2:B$36,\"CP1\",C$2:C$36)","v":64},{"$f":"IF(ISERROR(F2/SUM(C$2:C$36)),\"\",F2/SUM(C$2:C$36))","v":0.28828828828828829},null,{"$f":"IF(Données!A3=\"\",\"\",Données!A3)","v":"9830004M"},{"$f":"IF(SUM(L2:AT2)=0,\"\",SUM(L2:AT2))","v":4},{"$f":"IF(ISERROR(INDIRECT(\"'\"&$I2&\"'!$j$77\")),\"\",INDIRECT(\"'\"&$I2&\"'!$j$77\"))","v":3},{"$f":"IF(ISERROR(IF(COUNTIF(INDIRECT(\"'\"&$I2&\"'!$D$5:$D$80\"),L$1)>0,1,\"\")),\"\",IF(COUNTIF(INDIRECT(\"'\"&$I2&\"'!$D$5:$D$80\"),L$1)>0,1,\"\"))","v":1},{"$f":"IF(ISERROR(IF(COUNTIF(INDIRECT(\"'\"&$I2&\"'!$D$5:$D$80\"),M$1)>0,1,\"\")),\"\",IF(COUNTIF(INDIRECT(\"'\"&$I2&\"'!$D$5:$D$80\"),M$1)>0,1,\"\"))","v":""},"","","","","","","","",1,"","",1,"","","","","","","","","","",1,"",{"$f":"IF(AL$1=\"\",\"\",IF(ISERROR(IF(COUNTIF(INDIRECT(\"'\"&$I2&\"'!$D$5:$D$80\"),AL$1)>0,1,\"\")),\"\",IF(COUNTIF(INDIRECT(\"'\"&$I2&\"'!$D$5:$D$80\"),AL$1)>0,1,\"\")))","v":""},"","","","","","","",{"$f":"IF(AT$1=\"\",\"\",IF(ISERROR(IF(COUNTIF(INDIRECT(\"'\"&$I2&\"'!$D$5:$D$80\"),AT$1)>0,1,\"\")),\"\",IF(COUNTIF(INDIRECT(\"'\"&$I2&\"'!$D$5:$D$80\"),AT$1)>0,1,\"\")))","v":""}]
["Haies","CP1",{"$f":"M$601","v":3},5.2631578947368418E-2,{"$f":"IF(ISERROR(C3/SUM(C$2:C$36)),\"\",C3/SUM(C$2:C$36))","v":1.3513513513513514E-2},null,null,null,{"$f":"IF(Données!A4=\"\",\"\",Données!A4)","v":"9830356V"},{"$f":"IF(SUM(L3:AT3)=0,\"\",SUM(L3:AT3))","v":3},{"$f":"IF(ISERROR(INDIRECT(\"'\"&$I3&\"'!$j$77\")),\"\",INDIRECT(\"'\"&$I3&\"'!$j$77\"))","v":3},{"$f":"IF(ISERROR(IF(COUNTIF(INDIRECT(\"'\"&$I3&\"'!$D$5:$D$80\"),L$1)>0,1,\"\")),\"\",IF(COUNTIF(INDIRECT(\"'\"&$I3&\"'!$D$5:$D$80\"),L$1)>0,1,\"\"))","v":""},"","","","",1,"","","",1,"","","","","","","","","","","","","","",1,"","","","","","","","","",""]
["Hauteur","CP1",{"$f":"N$601","v":3},5.2631578947368418E-2,1.3513513513513514E-2,null,null,null,{"$f":"IF(Données!A5=\"\",\"\",Données!A5)","v":"9830616C"},3,3,1,"","","","","","","","","","","",1,"","","","",1,"","","","","","","","","","","","","","","","",""]
["Javelot","CP1",{"$f":"O$601","v":17},0.2982456140350877,7.6576576576576572E-2,null,null,null,{"$f":"IF(Données!A6=\"\",\"\",Données!A6)","v":"9830656W"},3,3,1,"","","","","","","","","","","",1,"","","","","","","","","","","",1,"","","","","","","","","",""]
["Multibond","CP1",{"$f":"P$601","v":1},1.7543859649122806E-2,4.5045045045045045E-3,null,null,null,{"$f":"IF(Données!A7=\"\",\"\",Données!A7)","v":"9830524C"},3,3,"","","",1,"","","","","",1,"","","","","","","","","","","",1,"","","","","","","","","","","","",""]
["Relais-vitesse","CP1",{"$f":"Q$601","v":14},0.24561403508771928,6.3063063063063057E-2,null,null,null,{"$f":"IF(Données!A8=\"\",\"\",Données!A8)","v":"9830277J"},3,3,"","","","","","",1,"","",1,"","","","","","","","","","","","","","",1,"","","","","","","","","",""]
["Natation longue","CP1",{"$f":"R$601","v":2},3.5087719298245612E-2,9.0090090090090089E-3,null,null,null,{"$f":"IF(Données!A9=\"\",\"\",Données!A9)","v":"9830625M"},3,3,"",1,"","","","","","","","","","","","","","","","","",1,"","","","","","",1,"","","","","","","",""]
["Natation vitesse","CP1",{"$f":"S$601","v":2},3.5087719298245612E-2,9.0090090090090089E-3,null,null,null,{"$f":"IF(Données!A10=\"\",\"\",Données!A10)","v":"9830304N"},6,3,"","","","",1,1,"","","","","","",1,"","",1,"","",{"$f":"IF(ISERROR(IF(COUNTIF(INDIRECT(\"'\"&$I9&\"'!$D$5:$D$80\"),AD$1)>0,1,\"\")),\"\",IF(COUNTIF(INDIRECT(\"'\"&$I9&\"'!$D$5:$D$80\"),AD$1)>0,1,\"\"))","v":""},"","",1,"","",1,"","","","","","","","","",""]
["Canoë-Kayak","CP2",{"$f":"T$601","v":2},3.5087719298245612E-2,9.0090090090090089E-3,{"$f":"SUMIF(B$2:B$36,\"CP2\",C$2:C$36)","v":34},{"$f":"IF(ISERROR(F10/SUM(C$2:C$36)),\"\",F10/SUM(C$2:C$36))","v":0.15315315315315314},null,{"$f":"IF(Données!A11=\"\",\"\",Données!A11)","v":"9830649N"},4,3,"",{"$f":"IF(ISERROR(IF(COUNTIF(INDIRECT(\"'\"&$I10&\"'!$D$5:$D$80\"),M$1)>0,1,\"\")),\"\",IF(COUNTIF(INDIRECT(\"'\"&$I10&\"'!$D$5:$D$80\"),M$1)>0,1,\"\"))","v":""},"","","",1,"","","","","","",1,"","","","","","","","","","","","",1,"",1,"","","","","","",""]
["CO","CP2",{"$f":"U$601","v":16},0.2807017543859649,7.2072072072072071E-2,null,null,null,{"$f":"IF(Données!A12=\"\",\"\",Données!A12)","v":"9830640D"},3,3,1,"","","","","","","","","","","",1,"","","","",1,"","","","","","","","","","","","","","","","",""]
["Escalade","CP2",{"$f":"V$601","v":1},1.7543859649122806E-2,4.5045045045045045E-3,null,null,null,{"$f":"IF(Données!A13=\"\",\"\",Données!A13)","v":"9830626N"},3,3,1,"","","","","","","","","","","",1,"","","","","","","",1,"","","","","","","","","","","","","",""]
["Aérobic","CP3",{"$f":"W$601","v":2},3.5087719298245612E-2,9.0090090090090089E-3,{"$f":"SUMIF(B$2:B$36,\"CP3\",C$2:C$36)","v":43},{"$f":"IF(ISERROR(F13/SUM(C$2:C$36)),\"\",F13/SUM(C$2:C$36))","v":0.19369369369369369},null,{"$f":"IF(Données!A14=\"\",\"\",Données!A14)","v":"9830474Y"},5,3.375,1,"","","","","","","","","","","",1,"","","",1,"","",1,"","","","",1,"","","","","","","","","",""]
["Acrosport","CP3",{"$f":"X$601","v":21},0.36842105263157893,9.45945945945946E-2,null,null,null,{"$f":"IF(Données!A15=\"\",\"\",Données!A15)","v":"9830384A"},3,3,"","","","","",1,"","","","","","",1,"","","","","","","","","","","",1,"","","","","","","","","",""]
["Gymnastique sportive","CP3",{"$f":"Y$601","v":7},0.12280701754385964,3.1531531531531529E-2,null,null,null,{"$f":"IF(Données!A16=\"\",\"\",Données!A16)","v":"9830538T"},7,3,1,1,1,"","","","","","",1,"","",1,"","","","",1,"","","",1,"","","","","","","","",{"$f":"IF(AP$1=\"\",\"\",IF(ISERROR(IF(COUNTIF(INDIRECT(\"'\"&$I15&\"'!$D$5:$D$80\"),AP$1)>0,1,\"\")),\"\",IF(COUNTIF(INDIRECT(\"'\"&$I15&\"'!$D$5:$D$80\"),AP$1)>0,1,\"\")))","v":""},"","","",""]
["Gymnastique rythmique","CP3",{"$f":"Z$601","v":0},0,0,null,null,null,{"$f":"IF(Données!A17=\"\",\"\",Données!A17)","v":"9830624L"},6,6,1,"","",1,"","","","","",1,"","","","","","",1,"","",1,"","","","",1,"","","","","","","","","",""]
["Arts du cirque","CP3",{"$f":"AA$601","v":4},7.0175438596491224E-2,1.8018018018018018E-2,null,null,null,{"$f":"IF(Données!A18=\"\",\"\",Données!A18)","v":"9830009T"},3,3,"","","","","","","","","",1,"","",1,"","","","",{"$f":"IF(ISERROR(IF(COUNTIF(INDIRECT(\"'\"&$I17&\"'!$D$5:$D$80\"),AC$1)>0,1,\"\")),\"\",IF(COUNTIF(INDIRECT(\"'\"&$I17&\"'!$D$5:$D$80\"),AC$1)>0,1,\"\"))","v":""},"","","","","","",1,"","","","","","","","","",""]
["Danse","CP3",{"$f":"AB$601","v":9},0.15789473684210525,4.0540540540540543E-2,null,null,null,{"$f":"IF(Données!A19=\"\",\"\",Données!A19)","v":"9830477B"},3,3,"","","",1,"","","","","","","","",1,"","","",{"$f":"IF(ISERROR(IF(COUNTIF(INDIRECT(\"'\"&$I18&\"'!$D$5:$D$80\"),AB$1)>0,1,\"\")),\"\",IF(COUNTIF(INDIRECT(\"'\"&$I18&\"'!$D$5:$D$80\"),AB$1)>0,1,\"\"))","v":""},"","","","","","","",1,"","","","","","","","","",""]
["Basket","CP4",{"$f":"AC$601","v":8},0.14035087719298245,3.6036036036036036E-2,{"$f":"SUMIF(B$2:B$36,\"CP4\",C$2:C$36)","v":81},{"$f":"IF(ISERROR(F19/SUM(C$2:C$36)),\"\",F19/SUM(C$2:C$36))","v":0.36486486486486486},null,{"$f":"IF(Données!A20=\"\",\"\",Données!A20)","v":"9830010U"},4,4,1,"","","","","","","","","","","","","","","","","","",1,"","","","",1,"",1,"","","","","","","",""]
["Foot","CP4",{"$f":"AD$601","v":11},0.19298245614035087,4.954954954954955E-2,null,null,null,{"$f":"IF(Données!A21=\"\",\"\",Données!A21)","v":"9830355U"},4,3,1,"","","","","","","","",1,"","","","","","","","","",1,"","","","","","","","","",1,"","","","",""]
["Hand","CP4",{"$f":"AE$601","v":9},0.15789473684210525,4.0540540540540543E-2,null,null,null,{"$f":"IF(Données!A22=\"\",\"\",Données!A22)","v":"9830493U"},4,4,1,"","","","","","","","","","","",1,"","","","","","","","","","","","",1,"","",1,"","","","","",""]
["Rugby","CP4",{"$f":"AF$601","v":1},1.7543859649122806E-2,4.5045045045045045E-3,null,null,null,{"$f":"IF(Données!A23=\"\",\"\",Données!A23)","v":"9830278K"},4,3,1,"","","","","","","","","","","","","","","","","",1,"","",1,"","","","","","",1,"","","","","",""]
["Volley","CP4",{"$f":"AG$601","v":22},0.38596491228070173,9.90990990990991E-2,null,null,null,{"$f":"IF(Données!A24=\"\",\"\",Données!A24)","v":"9830007R"},4,3.75,1,"","","","","","","","","","","","",1,"","","","","","","",1,"","","",1,"","","","","","","","",""]
["Lutte","CP4",{"$f":"AH$601","v":1},1.7543859649122806E-2,4.5045045045045045E-3,null,null,null,{"$f":"IF(Données!A25=\"\",\"\",Données!A25)","v":"9830419N"},3,3,"","","",1,"","","","","","","","",1,"","","","","","","","","","","",1,"","","","","","","","","",""]
["Boxe Française","CP4",{"$f":"AI$601","v":0},0,0,null,null,null,{"$f":"IF(Données!A26=\"\",\"\",Données!A26)","v":"9830418M"},5,3,"","","",1,"","","","","","","","",1,1,"","","","",1,"","","","","",1,"","","","","","","","","",""]
["Badminton","CP4",{"$f":"AJ$601","v":20},0.35087719298245612,9.0090090090090086E-2,null,null,null,{"$f":"IF(Données!A27=\"\",\"\",Données!A27)","v":"9830008S"},5,3,"","","","","","",1,"","","","","",1,"","",1,"","","",1,"","","","",1,"","","","","","","","","",""]
["Tennis de table","CP4",{"$f":"AK$601","v":8},0.14035087719298245,3.6036036036036036E-2,null,null,null,{"$f":"IF(Données!A28=\"\",\"\",Données!A28)","v":"9830522A"},7,4,1,"","","","","","","",1,"","","","","","","",1,"",1,"","",1,"","",1,"","",1,"","","","","","",""]
[{"$f":"IF(Données!H34=\"\",\"\",Données!H34)","v":"Va'a"},{"$f":"IF(Données!I34=\"\",\"\",Données!I34)","v":"CP2"},{"$f":"AL$601","v":2},3.5087719298245612E-2,9.0090090090090089E-3,null,null,null,{"$f":"IF(Données!A29=\"\",\"\",Données!A29)","v":"9830632V"},3,3,"","","",1,"","","","","",1,"","","","","","","",1,"","","","","","","","","","","","","","","","",""]
[{"$f":"IF(Données!H35=\"\",\"\",Données!H35)","v":"Planche à voile"},{"$f":"IF(Données!I35=\"\",\"\",Données!I35)","v":"CP2"},{"$f":"AM$601","v":8},0.14035087719298245,3.6036036036036036E-2,null,null,null,{"$f":"IF(Données!A30=\"\",\"\",Données!A30)","v":"9830357W"},3,3,"","","","","",1,"","","","","","","","","","","","","",1,"","","","","","","",1,"","","","","","",""]
[{"$f":"IF(Données!H36=\"\",\"\",Données!H36)","v":"Voile"},{"$f":"IF(Données!I36=\"\",\"\",Données!I36)","v":"CP2"},{"$f":"AN$601","v":5},8.771929824561403E-2,2.2522522522522521E-2,null,null,null,{"$f":"IF(Données!A31=\"\",\"\",Données!A31)","v":"9830482G"},5,4,1,"","","","","","","","",1,"","","","","","","",1,1,"","",1,"","","","","","","","","","","","",""]
[{"$f":"IF(Données!H37=\"\",\"\",Données!H37)","v":"Ultimate"},{"$f":"IF(Données!I37=\"\",\"\",Données!I37)","v":"CP4"},{"$f":"AO$601","v":1},1.7543859649122806E-2,4.5045045045045045E-3,null,null,null,{"$f":"IF(Données!A32=\"\",\"\",Données!A32)","v":"9830414H"},4,3,1,"","",1,"","","","","",1,"","","","","","","","","","","",1,"","","","","","","","","","","","",""]
[{"$f":"IF(Données!H38=\"\",\"\",Données!H38)","v":""},{"$f":"IF(Données!I38=\"\",\"\",Données!I38)","v":""},{"$f":"AP$601","v":0},0,0,null,null,null,{"$f":"IF(Données!A33=\"\",\"\",Données!A33)","v":"9830639C"},4,3,"","","",1,"","","","","","","","","","","","","","","","","",1,"","","","","",1,1,"","","","","",""]
[{"$f":"IF(Données!H39=\"\",\"\",Données!H39)","v":""},{"$f":"IF(Données!I39=\"\",\"\",Données!I39)","v":""},{"$f":"AQ$601","v":0},0,0,null,null,null,{"$f":"IF(Données!A34=\"\",\"\",Données!A34)","v":"9830492T"},3,3,{"$f":"IF(ISERROR(IF(COUNTIF(INDIRECT(\"'\"&$I33&\"'!$D$5:$D$80\"),L$1)>0,1,\"\")),\"\",IF(COUNTIF(INDIRECT(\"'\"&$I33&\"'!$D$5:$D$80\"),L$1)>0,1,\"\"))","v":""},"","",1,"","","","","","","","",1,"","","","","","","","",1,"","","","","","","","","","","","",""]
[{"$f":"IF(Données!H40=\"\",\"\",Données!H40)","v":""},{"$f":"IF(Données!I40=\"\",\"\",Données!I40)","v":""},{"$f":"AR$601","v":0},0,0,null,null,null,{"$f":"IF(Données!A35=\"\",\"\",Données!A35)","v":"9830516U"},"","","","","","","","","","","","","","","","","","",{"$f":"IF(ISERROR(IF(COUNTIF(INDIRECT(\"'\"&$I34&\"'!$D$5:$D$80\"),AB$1)>0,1,\"\")),\"\",IF(COUNTIF(INDIRECT(\"'\"&$I34&\"'!$D$5:$D$80\"),AB$1)>0,1,\"\"))","v":""},"","","","","","","","","","","","","","","","","",""]
[{"$f":"IF(Données!H41=\"\",\"\",Données!H41)","v":""},{"$f":"IF(Données!I41=\"\",\"\",Données!I41)","v":""},{"$f":"AS$601","v":0},0,0,null,null,null,{"$f":"IF(Données!A36=\"\",\"\",Données!A36)","v":"VANUATU"},3,3,"","","","","",1,"","","",1,"","","","","","","","","",1,"","","","","","","","","","","","","","",""]
[{"$f":"IF(Données!H42=\"\",\"\",Données!H42)","v":""},{"$f":"IF(Données!I42=\"\",\"\",Données!I42)","v":""},{"$f":"AT$601","v":0},0,0,null,null,null,{"$f":"IF(Données!A37=\"\",\"\",Données!A37)","v":"9830508K"},3,3,1,"","","","","","","","",1,"","","","","","","","","","","",1,"","","","","","","","","","","","",""]
[{"$f":"COUNTIF(J2:J600,\">0\")","v":57},null,null,null,null,null,{"$f":"SUM(G2:G36)","v":1},null,{"$f":"IF(Données!A38=\"\",\"\",Données!A38)","v":"9830681Y"},3,3,1,"","","","","","","","","","","",1,"","","","","","","","",1,"","","","","","","","","","","","",""]
[null,null,null,null,null,null,null,null,{"$f":"IF(Données!A39=\"\",\"\",Données!A39)","v":"9830259P"},7,3.5,1,"","","","",1,"","","",1,"","","",1,"","","","","","","",1,"","","",1,"",1,"","","","","","",""]
[null,null,null,null,null,null,null,null,{"$f":"IF(Données!A40=\"\",\"\",Données!A40)","v":"9830260R"},3,3,"","","","","",1,"","","","","","","","","","",1,"","","","","","","","",1,"","","","","","","","",""]
[null,null,null,null,null,null,null,null,{"$f":"IF(Données!A41=\"\",\"\",Données!A41)","v":"9830263U"},4,{"$f":"IF(ISERROR(INDIRECT(\"'\"&$I40&\"'!$j$77\")),\"\",INDIRECT(\"'\"&$I40&\"'!$j$77\"))","v":4},"","","","","",1,"","","","","","","",1,"","","","","",1,"","","","",1,"","","","","","","","","",""]
[null,null,null,null,null,null,null,null,{"$f":"IF(Données!A42=\"\",\"\",Données!A42)","v":"9830264V"},7,{"$f":"IF(ISERROR(INDIRECT(\"'\"&$I41&\"'!$j$77\")),\"\",INDIRECT(\"'\"&$I41&\"'!$j$77\"))","v":3},"",1,"","","","","","","",1,"","","","","","","",1,1,"","",1,"","","","","",1,1,"","","","","",""]
[null,null,null,null,null,null,null,null,{"$f":"IF(Données!A43=\"\",\"\",Données!A43)","v":"9830381X"},3,3,"","","",1,"","","","","",1,"","","","","","","","",1,"","","","","","","","","","","","","","","",""]
[null,null,null,null,null,null,null,null,{"$f":"IF(Données!A44=\"\",\"\",Données!A44)","v":"9830265W"},7,3,"","","",1,"",1,"","","","","","",1,"","","",1,"",1,"","","",1,"",1,"","","","","","","","",{"$f":"IF(AS$1=\"\",\"\",IF(ISERROR(IF(COUNTIF(INDIRECT(\"'\"&$I43&\"'!$D$5:$D$80\"),AS$1)>0,1,\"\")),\"\",IF(COUNTIF(INDIRECT(\"'\"&$I43&\"'!$D$5:$D$80\"),AS$1)>0,1,\"\")))","v":""},""]
[null,null,null,null,null,null,null,null,{"$f":"IF(Données!A45=\"\",\"\",Données!A45)","v":"9830298G"},3,3,"","","",1,"","","","","","","",1,"","","","","","","","","","","","","",1,"","","","","","","","",""]
[null,null,null,null,null,null,null,null,{"$f":"IF(Données!A46=\"\",\"\",Données!A46)","v":"9830354T"},5,5,"","",1,1,"","","","","","","",1,"","","","","","","","","",1,"","","",1,"","","","","","","","",""]
[null,null,null,null,null,null,null,null,{"$f":"IF(Données!A47=\"\",\"\",Données!A47)","v":"9830266X"},5,4,"","","","","",1,"","","","","","","","","","",1,"","","","",1,"","",1,"","","",1,"","","","","",""]
[null,null,null,null,null,null,null,null,{"$f":"IF(Données!A48=\"\",\"\",Données!A48)","v":"9830400T"},4,3,"","","",1,"","","","","","","","",1,"","","","","",1,"","",1,"","","","","","","","","","","","",""]
[null,null,null,null,null,null,null,null,{"$f":"IF(Données!A49=\"\",\"\",Données!A49)","v":"9830297F"},3,3,1,"","","","","","","","","","","",1,"","",{"$f":"IF(ISERROR(IF(COUNTIF(INDIRECT(\"'\"&$I48&\"'!$D$5:$D$80\"),AA$1)>0,1,\"\")),\"\",IF(COUNTIF(INDIRECT(\"'\"&$I48&\"'!$D$5:$D$80\"),AA$1)>0,1,\"\"))","v":""},"","",1,"","","","","","","","","","","","","","","",""]
[null,null,null,null,null,null,null,null,{"$f":"IF(Données!A50=\"\",\"\",Données!A50)","v":"9830313Y"},"","",{"$f":"IF(ISERROR(IF(COUNTIF(INDIRECT(\"'\"&$I49&\"'!$D$5:$D$80\"),L$1)>0,1,\"\")),\"\",IF(COUNTIF(INDIRECT(\"'\"&$I49&\"'!$D$5:$D$80\"),L$1)>0,1,\"\"))","v":""},"","","","","","","","","","","","","","","","","","","","","","","","","","","","","","","","","",""]
[null,null,null,null,null,null,null,null,{"$f":"IF(Données!A51=\"\",\"\",Données!A51)","v":"9830382Y"},3,3,"","","",1,"","","","","","","","","","","",1,"","","","","","","","",1,"","","","","","","","","",""]
[null,null,null,null,null,null,null,null,{"$f":"IF(Données!A52=\"\",\"\",Données!A52)","v":"9830431B"},"","","","","","","","","","","","","","","","","","","","","","","","","","","","","","","","","","","","",""]
[null,null,null,null,null,null,null,null,{"$f":"IF(Données!A53=\"\",\"\",Données!A53)","v":"9830518W"},3,3,1,"","","","","","","","","","","","",1,"","","","","","","",1,"","","","","","","","","","","","",""]
[null,null,null,null,null,null,null,null,{"$f":"IF(Données!A54=\"\",\"\",Données!A54)","v":"9830267Y"},3,3,"","",1,"","","","","","","","","","","","","",1,1,"","","","","","","","","","","","","","","","",""]
[null,null,null,null,null,null,null,null,{"$f":"IF(Données!A55=\"\",\"\",Données!A55)","v":"9830609V"},3,3,"","","",1,"","","","","","","","","","","",1,"","",1,"","","","","","","","","","","","","","","",""]
[null,null,null,null,null,null,null,null,{"$f":"IF(Données!A56=\"\",\"\",Données!A56)","v":"9830447U"},3,3,"","","","","",1,"","",1,"","","","","","","","","","","","",1,"","","","","","","","","","","","",""]
[null,null,null,null,null,null,null,null,{"$f":"IF(Données!A57=\"\",\"\",Données!A57)","v":"9830295D"},3,3,"","","","","",1,"","","","","","","","","","","","","","","",1,"","","","","",1,"","","","","","",""]
[null,null,null,null,null,null,null,null,{"$f":"IF(Données!A58=\"\",\"\",Données!A58)","v":"9830392J"},5,3,"","","",1,"","","","","",1,"","","","","","",1,"",1,"","",1,"","","","","","","","","","","","",""]
[null,null,null,null,null,null,null,null,{"$f":"IF(Données!A59=\"\",\"\",Données!A59)","v":"9830420P"},3,3,"","","","","",1,"","","","","","","","","","",1,"","","","",1,"","","","","","","","","","","","",""]
[null,null,null,null,null,null,null,null,{"$f":"IF(Données!A60=\"\",\"\",Données!A60)","v":"9830268Z"},"","","","","","","","","","","","","","","","","","","","","","","","","","","","","","","","","","","","",""]
[null,null,null,null,null,null,null,null,{"$f":"IF(Données!A61=\"\",\"\",Données!A61)","v":"9830472W"},"","","","","","","","","","","","","","","","","","","","","","","","","","","","","","","","","","","","",""]
[null,null,null,null,null,null,null,null,{"$f":"IF(Données!A62=\"\",\"\",Données!A62)","v":"9830432C"},3,3,1,"","","","","","","","","","","","",1,"","","",1,"","","","","","","","","","","","","","","","",""]
[null,null,null,null,null,null,null,null,{"$f":"IF(Données!A63=\"\",\"\",Données!A63)","v":"9830672N"},"","","","","","","","","","","","","","","","","","","","","","","","","","","","","","","","","","","","",""]
[null,null,null,null,null,null,null,null,{"$f":"IF(Données!A64=\"\",\"\",Données!A64)","v":"9830270B"},3,3,"","","","","","","",1,"","","","",1,"","","","","","","","","","","","",1,"","","","","","","","",""]
[null,null,null,null,null,null,null,null,{"$f":"IF(Données!A65=\"\",\"\",Données!A65)","v":"9830537S"},"","","","","","","","","","","","","","","","","",{"$f":"IF(ISERROR(IF(COUNTIF(INDIRECT(\"'\"&$I64&\"'!$D$5:$D$80\"),AA$1)>0,1,\"\")),\"\",IF(COUNTIF(INDIRECT(\"'\"&$I64&\"'!$D$5:$D$80\"),AA$1)>0,1,\"\"))","v":""},"","","","","","","","","","","","","","","","","","",""]
[null,null,null,null,null,null,null,null,{"$f":"IF(Données!A66=\"\",\"\",Données!A66)","v":"9830271C"},3,3,{"$f":"IF(ISERROR(IF(COUNTIF(INDIRECT(\"'\"&$I65&\"'!$D$5:$D$80\"),L$1)>0,1,\"\")),\"\",IF(COUNTIF(INDIRECT(\"'\"&$I65&\"'!$D$5:$D$80\"),L$1)>0,1,\"\"))","v":""},"","","","","","",1,"","","","","","","","","","","","","","","","",1,"","",1,"","","","","","",""]
[null,null,null,null,null,null,null,null,{"$f":"IF(Données!A67=\"\",\"\",Données!A67)","v":""},"","","","","","","","","","","","","","","","","","","","","","","","","","","","","","","","","","","","",""]
[null,null,null,null,null,null,null,null,{"$f":"IF(Données!A68=\"\",\"\",Données!A68)","v":""},{"$f":"IF(SUM(L67:AT67)=0,\"\",SUM(L67:AT67))","v":""},"","","","","","","","","","","","","","","","","","","","","","","","","","","","","","","","","","","",""]
[null,null,null,null,null,null,null,null,{"$f":"IF(Données!A69=\"\",\"\",Données!A69)","v":""},"","","","","","","","","","","","","","","","","","","","","","","","","","","","","","","","","","","","",""]
[null,null,null,null,null,null,null,null,{"$f":"IF(Données!A70=\"\",\"\",Données!A70)","v":""},"","","","","","","","","","","","","","","","","","","","","","","","","","","","","","","","","","","","",""]
[null,null,null,null,null,null,null,null,{"$f":"IF(Données!A71=\"\",\"\",Données!A71)","v":""},"","","","","","","","","","","","","","","","","","","","","","","","","","","","","","","","","","","","",""]
[null,null,null,null,null,null,null,null,{"$f":"IF(Données!A72=\"\",\"\",Données!A72)","v":""},"","","","","","","","","","","","","","","","","","","","","","","","","","","","","","","","","","","","",""]
[null,null,null,null,null,null,null,null,{"$f":"IF(Données!A73=\"\",\"\",Données!A73)","v":""},"","","","","","","","","","","","","","","","","","","","","","","","","","","","","",{"$f":"IF(AM$1=\"\",\"\",IF(ISERROR(IF(COUNTIF(INDIRECT(\"'\"&$I72&\"'!$D$5:$D$80\"),AM$1)>0,1,\"\")),\"\",IF(COUNTIF(INDIRECT(\"'\"&$I72&\"'!$D$5:$D$80\"),AM$1)>0,1,\"\")))","v":""},"","","","","","",""]
[null,null,null,null,null,null,null,null,{"$f":"IF(Données!A74=\"\",\"\",Données!A74)","v":""},"","","","","","","","","","","","","","","","","","","","","","","","","","","","","","","","","","","","",""]
[null,null,null,null,null,null,null,null,{"$f":"IF(Données!A75=\"\",\"\",Données!A75)","v":""},"","","","","","","","","","","","","","","","","","","","","","","","","","","","","","","","","","","","",""]
[null,null,null,null,null,null,null,null,{"$f":"IF(Données!A76=\"\",\"\",Données!A76)","v":""},"","","","","","","","","","","","","","","","","","","","","","","","","","","","","","","","","","","","",""]
[null,null,null,null,null,null,null,null,{"$f":"IF(Données!A77=\"\",\"\",Données!A77)","v":""},"","","","","","","","","","","","","","","","","","","","","","","","","","","","","","","","","","","","",""]
[null,null,null,null,null,null,null,null,{"$f":"IF(Données!A78=\"\",\"\",Données!A78)","v":""},"","","","","","","","","","","","","","","","","","","","","","","","","","","","","","","","","","","","",""]
[null,null,null,null,null,null,null,null,{"$f":"IF(Données!A79=\"\",\"\",Données!A79)","v":""},"","","","","","","","","","","","","","","","","","","","","","","","","","","","","","","","","","","","",""]
[null,null,null,null,null,null,null,null,{"$f":"IF(Données!A80=\"\",\"\",Données!A80)","v":""},"","","","","","","","","","","","","","","","","","","","","","","","","","","","","","","","","","","","",""]
[null,null,null,null,null,null,null,null,{"$f":"IF(Données!A81=\"\",\"\",Données!A81)","v":""},"","","","","","","","","","","","","","","","","",{"$f":"IF(ISERROR(IF(COUNTIF(INDIRECT(\"'\"&$I80&\"'!$D$5:$D$80\"),AA$1)>0,1,\"\")),\"\",IF(COUNTIF(INDIRECT(\"'\"&$I80&\"'!$D$5:$D$80\"),AA$1)>0,1,\"\"))","v":""},"","","","","","","","","","","","","","","","","","",""]
[null,null,null,null,null,null,null,null,{"$f":"IF(Données!A82=\"\",\"\",Données!A82)","v":""},"","",{"$f":"IF(ISERROR(IF(COUNTIF(INDIRECT(\"'\"&$I81&\"'!$D$5:$D$80\"),L$1)>0,1,\"\")),\"\",IF(COUNTIF(INDIRECT(\"'\"&$I81&\"'!$D$5:$D$80\"),L$1)>0,1,\"\"))","v":""},"","","","","","","","","","","","","","","","","","","","","","","","","","","","","","","","","",""]
[null,null,null,null,null,null,null,null,{"$f":"IF(Données!A83=\"\",\"\",Données!A83)","v":""},"","","","","","","","","","","","","","","","","","","","","","","","","","","","","","","","","","","","",""]
[null,null,null,null,null,null,null,null,{"$f":"IF(Données!A84=\"\",\"\",Données!A84)","v":""},"","","","","","","","","","","","","","","","","","","","","","","","","","","","","","","","","","","","",""]
[null,null,null,null,null,null,null,null,{"$f":"IF(Données!A85=\"\",\"\",Données!A85)","v":""},"","","","","","","","","","","","","","","","","","","","","","","","","","","","","","","","","","","","",""]
[null,null,null,null,null,null,null,null,{"$f":"IF(Données!A86=\"\",\"\",Données!A86)","v":""},"","","","","","","","","","","","","","","","","","","","","","","","","","","","","","","","","","","","",""]
[null,null,null,null,null,null,null,null,{"$f":"IF(Données!A87=\"\",\"\",Données!A87)","v":""},"","","","","","","","","","","","","","","","","","","","","","","","","","","","","","","","","","","","",""]
[null,null,null,null,null,null,null,null,{"$f":"IF(Données!A88=\"\",\"\",Données!A88)","v":""},"","","","","","","","","","","","","","","","","","","","","","","","","","","","","","","","","","","","",""]
[null,null,null,null,null,null,null,null,{"$f":"IF(Données!A89=\"\",\"\",Données!A89)","v":""},"","","","","","","","","","","","","","","","","","","","","","","","","","","","","","","","","","","","",""]
[null,null,null,null,null,null,null,null,{"$f":"IF(Données!A90=\"\",\"\",Données!A90)","v":""},"","","","","","","","","","","","","","","","","","","","","","","","","","","","","","","","","","","","",""]
[null,null,null,null,null,null,null,null,{"$f":"IF(Données!A91=\"\",\"\",Données!A91)","v":""},"","","","","","","","","","","","","","","","","","","","","","","","","","","","","","","","","","","","",""]
[null,null,null,null,null,null,null,null,{"$f":"IF(Données!A92=\"\",\"\",Données!A92)","v":""},"","","","","","","","","","","","","","","","","","","","","","","","","","","","","","","","","","","","",""]
[null,null,null,null,null,null,null,null,{"$f":"IF(Données!A93=\"\",\"\",Données!A93)","v":""},"","","","","","","","","","","","","","","","","","","","","","","","","","","","","","","","","","","","",""]
[null,null,null,null,null,null,null,null,{"$f":"IF(Données!A94=\"\",\"\",Données!A94)","v":""},"","","","","","","","","","","","","","","","","","","","","","","","","","","","","","","","","","","","",""]
[null,null,null,null,null,null,null,null,{"$f":"IF(Données!A95=\"\",\"\",Données!A95)","v":""},"","","","","","","","","","","","","","","","","","","","","","","","","","","","","","","","","","","","",""]
[null,null,null,null,null,null,null,null,{"$f":"IF(Données!A96=\"\",\"\",Données!A96)","v":""},"","","","","","","","","","","","","","","","","","","","","","","","","","","","","","","","","","","","",""]
[null,null,null,null,null,null,null,null,{"$f":"IF(Données!A97=\"\",\"\",Données!A97)","v":""},"","","","","","","","","","","","","","","","","",{"$f":"IF(ISERROR(IF(COUNTIF(INDIRECT(\"'\"&$I96&\"'!$D$5:$D$80\"),AA$1)>0,1,\"\")),\"\",IF(COUNTIF(INDIRECT(\"'\"&$I96&\"'!$D$5:$D$80\"),AA$1)>0,1,\"\"))","v":""},"","","","","","","","","","","","","","","","","","",""]
[null,null,null,null,null,null,null,null,{"$f":"IF(Données!A98=\"\",\"\",Données!A98)","v":""},"","",{"$f":"IF(ISERROR(IF(COUNTIF(INDIRECT(\"'\"&$I97&\"'!$D$5:$D$80\"),L$1)>0,1,\"\")),\"\",IF(COUNTIF(INDIRECT(\"'\"&$I97&\"'!$D$5:$D$80\"),L$1)>0,1,\"\"))","v":""},"","","","","","","","","","","","","","","","","","","","","","","","","","","","","","","","","",""]
[null,null,null,null,null,null,null,null,{"$f":"IF(Données!A99=\"\",\"\",Données!A99)","v":""},"","","","","","","","","","","","","","","","","","","","","","","","","","","","","","","","","","","","",""]
[null,null,null,null,null,null,null,null,{"$f":"IF(Données!A100=\"\",\"\",Données!A100)","v":""},"","","","","","","","","","","","","","","","","","","","","","","","","","","","","","","","","","","","",""]
[null,null,null,null,null,null,null,null,{"$f":"IF(Données!A101=\"\",\"\",Données!A101)","v":""},"","","","","","","","","","","","","","","","","","","","","","","","","","","","","","","","",{"$f":"IF(AP$1=\"\",\"\",IF(ISERROR(IF(COUNTIF(INDIRECT(\"'\"&$I100&\"'!$D$5:$D$80\"),AP$1)>0,1,\"\")),\"\",IF(COUNTIF(INDIRECT(\"'\"&$I100&\"'!$D$5:$D$80\"),AP$1)>0,1,\"\")))","v":""},"","","",""]
[null,null,null,null,null,null,null,null,{"$f":"IF(Données!A102=\"\",\"\",Données!A102)","v":""},"","","","","","","","","","","","","","","","","","","","","","","","","","","","","","","","","","","","",""]
[null,null,null,null,null,null,null,null,{"$f":"IF(Données!A103=\"\",\"\",Données!A103)","v":""},"","","","","","","","","","","","","","","","","","","","","","","","","","","","","","","","","","","","",""]
[null,null,null,null,null,null,null,null,{"$f":"IF(Données!A104=\"\",\"\",Données!A104)","v":""},"","","","","","","","","","","","","","","","","","","","","","","","","","","","","","","","","","","","",""]
[null,null,null,null,null,null,null,null,{"$f":"IF(Données!A105=\"\",\"\",Données!A105)","v":""},"","","","","","","","","","","","","","","","","","","","","","","","","","","","","","","","","","","","",""]
[null,null,null,null,null,null,null,null,{"$f":"IF(Données!A106=\"\",\"\",Données!A106)","v":""},"",{"$f":"IF(ISERROR(INDIRECT(\"'\"&$I105&\"'!$j$77\")),\"\",INDIRECT(\"'\"&$I105&\"'!$j$77\"))","v":""},"","","","","","","","","","","","","","","","","","","","","","","","","","","","","","","","","","",""]
[null,null,null,null,null,null,null,null,{"$f":"IF(Données!A107=\"\",\"\",Données!A107)","v":""},"","","","","","","","","","","","","","","","","","","","","","","","","","","","","","","","","","","","",""]
[null,null,null,null,null,null,null,null,{"$f":"IF(Données!A108=\"\",\"\",Données!A108)","v":""},"","","","","","","","","","","","","","","","","","","","","","","","","","","","","","","","","","","","",""]
[null,null,null,null,null,null,null,null,{"$f":"IF(Données!A109=\"\",\"\",Données!A109)","v":""},"","","","","","","","","","","","","","","","","","","","","","","","","","","","","","","","","","","","",""]
[null,null,null,null,null,null,null,null,{"$f":"IF(Données!A110=\"\",\"\",Données!A110)","v":""},"","","","","","","","","","","","","","","","","","","","","","","","","","","","","","","","","","","","",""]
[null,null,null,null,null,null,null,null,{"$f":"IF(Données!A111=\"\",\"\",Données!A111)","v":""},"","","","","","","","","","","","","","","","","","","","","","","","","","","","","","","","","","","","",""]
[null,null,null,null,null,null,null,null,{"$f":"IF(Données!A112=\"\",\"\",Données!A112)","v":""},"","","","","","","","","","","","","","","","","","","","","","","","","","","","","","","","","","","","",""]
[null,null,null,null,null,null,null,null,{"$f":"IF(Données!A113=\"\",\"\",Données!A113)","v":""},"","","","","","","","","","","","","","","","","",{"$f":"IF(ISERROR(IF(COUNTIF(INDIRECT(\"'\"&$I112&\"'!$D$5:$D$80\"),AA$1)>0,1,\"\")),\"\",IF(COUNTIF(INDIRECT(\"'\"&$I112&\"'!$D$5:$D$80\"),AA$1)>0,1,\"\"))","v":""},"","","","","","","","","","","","","","","","","","",""]
[null,null,null,null,null,null,null,null,{"$f":"IF(Données!A114=\"\",\"\",Données!A114)","v":""},"","",{"$f":"IF(ISERROR(IF(COUNTIF(INDIRECT(\"'\"&$I113&\"'!$D$5:$D$80\"),L$1)>0,1,\"\")),\"\",IF(COUNTIF(INDIRECT(\"'\"&$I113&\"'!$D$5:$D$80\"),L$1)>0,1,\"\"))","v":""},"","","","","","","","","","","","","","","","","","","","","","","","","","","","","","","","","",""]
[null,null,null,null,null,null,null,null,{"$f":"IF(Données!A115=\"\",\"\",Données!A115)","v":""},"","","","","","","","","","","","","","","","","","","","","","","","","","","","","","","","","","","","",""]
[null,null,null,null,null,null,null,null,{"$f":"IF(Données!A116=\"\",\"\",Données!A116)","v":""},"","","","","","","","","","","","","","","","","","","","","","","","","","","","","","","","","","","","",""]
[null,null,null,null,null,null,null,null,{"$f":"IF(Données!A117=\"\",\"\",Données!A117)","v":""},"","","","","","","","","","","","","","","","","","","","","","","","","","","","","","","","","","","","",""]
[null,null,null,null,null,null,null,null,{"$f":"IF(Données!A118=\"\",\"\",Données!A118)","v":""},"","","","","","","","","","","","","","","","","","","","","","","","","","","","","","","","","","","","",""]
[null,null,null,null,null,null,null,null,{"$f":"IF(Données!A119=\"\",\"\",Données!A119)","v":""},"","","","","","","","","","","","","","","","","","","","","","","","","","","","","","","","","","","","",""]
[null,null,null,null,null,null,null,null,{"$f":"IF(Données!A120=\"\",\"\",Données!A120)","v":""},"","","","","","","","","","","","","","","","","","","","","","","","","","","","","","","","","","","","",""]
[null,null,null,null,null,null,null,null,{"$f":"IF(Données!A121=\"\",\"\",Données!A121)","v":""},"","","","","","","","","","","","","","","","","","","","","","","","","","","","","","","","","","","","",""]
[null,null,null,null,null,null,null,null,{"$f":"IF(Données!A122=\"\",\"\",Données!A122)","v":""},"","","","","","","","","","","","","","","","","","","","","","","","","","","","","","","","","","","","",""]
[null,null,null,null,null,null,null,null,{"$f":"IF(Données!A123=\"\",\"\",Données!A123)","v":""},"","","","","","","","","","","","","","","","","","","","","","","","","","","","","","","","","","","","",""]
[null,null,null,null,null,null,null,null,{"$f":"IF(Données!A124=\"\",\"\",Données!A124)","v":""},"","","","","","","","","","","","","","","","","","","","","","","","","","","","","","","","","","","","",""]
[null,null,null,null,null,null,null,null,{"$f":"IF(Données!A125=\"\",\"\",Données!A125)","v":""},"","","","","","","","","","","","","","","","","","","","","","","","","","","","","","","","","","","","",""]
[null,null,null,null,null,null,null,null,{"$f":"IF(Données!A126=\"\",\"\",Données!A126)","v":""},"","","","","","","","","","","","","","","","","","","","","","","","","","","","","","","","","","","","",""]
[null,null,null,null,null,null,null,null,{"$f":"IF(Données!A127=\"\",\"\",Données!A127)","v":""},"","","","","","","","","","","","","","","","","","","","","","","","","","","","","","","","","","","","",""]
[null,null,null,null,null,null,null,null,{"$f":"IF(Données!A128=\"\",\"\",Données!A128)","v":""},"","","","","","","","","","","","","","","","","","","","","","","","","","","","","","","","","","","","",""]
[null,null,null,null,null,null,null,null,{"$f":"IF(Données!A129=\"\",\"\",Données!A129)","v":""},"","","","","","","","","","","","","","","","","",{"$f":"IF(ISERROR(IF(COUNTIF(INDIRECT(\"'\"&$I128&\"'!$D$5:$D$80\"),AA$1)>0,1,\"\")),\"\",IF(COUNTIF(INDIRECT(\"'\"&$I128&\"'!$D$5:$D$80\"),AA$1)>0,1,\"\"))","v":""},"","","","","","","","","","","","","","","","","",{"$f":"IF(AS$1=\"\",\"\",IF(ISERROR(IF(COUNTIF(INDIRECT(\"'\"&$I128&\"'!$D$5:$D$80\"),AS$1)>0,1,\"\")),\"\",IF(COUNTIF(INDIRECT(\"'\"&$I128&\"'!$D$5:$D$80\"),AS$1)>0,1,\"\")))","v":""},""]
[null,null,null,null,null,null,null,null,{"$f":"IF(Données!A130=\"\",\"\",Données!A130)","v":""},"","",{"$f":"IF(ISERROR(IF(COUNTIF(INDIRECT(\"'\"&$I129&\"'!$D$5:$D$80\"),L$1)>0,1,\"\")),\"\",IF(COUNTIF(INDIRECT(\"'\"&$I129&\"'!$D$5:$D$80\"),L$1)>0,1,\"\"))","v":""},"","","","","","","","","","","","","","","","","","","","","","","","","","","","","","","","","",""]
[null,null,null,null,null,null,null,null,{"$f":"IF(Données!A131=\"\",\"\",Données!A131)","v":""},"","","","","","","","","","","","","","","","","","","","","","","","","","","","","","","","","","","","",""]
[null,null,null,null,null,null,null,null,{"$f":"IF(Données!A132=\"\",\"\",Données!A132)","v":""},{"$f":"IF(SUM(L131:AT131)=0,\"\",SUM(L131:AT131))","v":""},"","","","","","","","","","","","","","","","","","","","","","","","","","","","","","","","","","","",""]
[null,null,null,null,null,null,null,null,{"$f":"IF(Données!A133=\"\",\"\",Données!A133)","v":""},"","","","","","","","","","","","","","","","","","","","","","","","","","","","","","","","","","","","",""]
[null,null,null,null,null,null,null,null,{"$f":"IF(Données!A134=\"\",\"\",Données!A134)","v":""},"","","","","","","","","","","","","","","","","","","","","","","","","","","","","","","","","","","","",""]
[null,null,null,null,null,null,null,null,{"$f":"IF(Données!A135=\"\",\"\",Données!A135)","v":""},"","","","","","","","","","","","","","","","","","","","","","","","","","","","","","","","","","","","",""]
[null,null,null,null,null,null,null,null,{"$f":"IF(Données!A136=\"\",\"\",Données!A136)","v":""},"","","","","","","","","","","","","","","","","","","","","","","","","","","","","","","","","","","","",""]
[null,null,null,null,null,null,null,null,{"$f":"IF(Données!A137=\"\",\"\",Données!A137)","v":""},"","","","","","","","","","","","","","","","","","","","","","","","","","","","","","","","","","","","",""]
[null,null,null,null,null,null,null,null,{"$f":"IF(Données!A138=\"\",\"\",Données!A138)","v":""},"","","","","","","","","","","","","","","","","","","","","","","","","","","","","","","","","","","","",""]
[null,null,null,null,null,null,null,null,{"$f":"IF(Données!A139=\"\",\"\",Données!A139)","v":""},"","","","","","","","","","","","","","","","","","","","","","","","","","","","","","","","","","","","",""]
[null,null,null,null,null,null,null,null,{"$f":"IF(Données!A140=\"\",\"\",Données!A140)","v":""},"","","","","","","","","","","","","","","","","","","","","","","","","","","","","","","","","","","","",""]
[null,null,null,null,null,null,null,null,{"$f":"IF(Données!A141=\"\",\"\",Données!A141)","v":""},"","","","","","","","","","","","","","","","","","","","","","","","","","","","","","","","","","","","",""]
[null,null,null,null,null,null,null,null,{"$f":"IF(Données!A142=\"\",\"\",Données!A142)","v":""},"","","","","","","","","","","","","","","","","","","","","","","","","","","","","","","","","","","","",""]
[null,null,null,null,null,null,null,null,{"$f":"IF(Données!A143=\"\",\"\",Données!A143)","v":""},"","","","","","","","","","","","","","","","","","","","","","","","","","","","","","","","","","","","",""]
[null,null,null,null,null,null,null,null,{"$f":"IF(Données!A144=\"\",\"\",Données!A144)","v":""},"","","",{"$f":"IF(ISERROR(IF(COUNTIF(INDIRECT(\"'\"&$I143&\"'!$D$5:$D$80\"),M$1)>0,1,\"\")),\"\",IF(COUNTIF(INDIRECT(\"'\"&$I143&\"'!$D$5:$D$80\"),M$1)>0,1,\"\"))","v":""},"","","","","","","","","","","","","","","","","","","","","","","","","","","","","","","","",""]
[null,null,null,null,null,null,null,null,{"$f":"IF(Données!A145=\"\",\"\",Données!A145)","v":""},"","","","","","","","","","","","","","","","","","","","","","","","","","","","","","","","","","","","",""]
[null,null,null,null,null,null,null,null,{"$f":"IF(Données!A146=\"\",\"\",Données!A146)","v":""},"","","","","","","","","","","","","","","","","","","","","","","","","","","","","","","","","","","","",""]
[null,null,null,null,null,null,null,null,{"$f":"IF(Données!A147=\"\",\"\",Données!A147)","v":""},"","","","","","","","","","","","","","","","","","","","","","","","","","","","","","","","","","","","",""]
[null,null,null,null,null,null,null,null,{"$f":"IF(Données!A148=\"\",\"\",Données!A148)","v":""},"","","","","","","","","","","","","","","","","","","","","","","","","","","","","","","","","","","","",""]
[null,null,null,null,null,null,null,null,{"$f":"IF(Données!A149=\"\",\"\",Données!A149)","v":""},"","","","","","","","","","","","","","","","","","","","","","","","","","","","","","","","","","","","",""]
[null,null,null,null,null,null,null,null,{"$f":"IF(Données!A150=\"\",\"\",Données!A150)","v":""},"","","","","","","","","","","","","","","","","","","","","","","","","","","","","","","","","","","","",""]
[null,null,null,null,null,null,null,null,{"$f":"IF(Données!A151=\"\",\"\",Données!A151)","v":""},"","","","","","","","","","","","","","","","","","","",{"$f":"IF(ISERROR(IF(COUNTIF(INDIRECT(\"'\"&$I150&\"'!$D$5:$D$80\"),AC$1)>0,1,\"\")),\"\",IF(COUNTIF(INDIRECT(\"'\"&$I150&\"'!$D$5:$D$80\"),AC$1)>0,1,\"\"))","v":""},"","","","","","","","","","","","","","","","",""]
[null,null,null,null,null,null,null,null,{"$f":"IF(Données!A152=\"\",\"\",Données!A152)","v":""},"","","","","","","","","","","","","","","","","","",{"$f":"IF(ISERROR(IF(COUNTIF(INDIRECT(\"'\"&$I151&\"'!$D$5:$D$80\"),AB$1)>0,1,\"\")),\"\",IF(COUNTIF(INDIRECT(\"'\"&$I151&\"'!$D$5:$D$80\"),AB$1)>0,1,\"\"))","v":""},"","","","","","","","","","","","","","","","","",""]
[null,null,null,null,null,null,null,null,{"$f":"IF(Données!A153=\"\",\"\",Données!A153)","v":""},"","","","","","","","","",{"$f":"IF(ISERROR(IF(COUNTIF(INDIRECT(\"'\"&$I152&\"'!$D$5:$D$80\"),S$1)>0,1,\"\")),\"\",IF(COUNTIF(INDIRECT(\"'\"&$I152&\"'!$D$5:$D$80\"),S$1)>0,1,\"\"))","v":""},"","","","","","","","","","","","","","","","","","","","","","","","","","",""]
[null,null,null,null,null,null,null,null,{"$f":"IF(Données!A154=\"\",\"\",Données!A154)","v":""},"","",{"$f":"IF(ISERROR(IF(COUNTIF(INDIRECT(\"'\"&$I153&\"'!$D$5:$D$80\"),L$1)>0,1,\"\")),\"\",IF(COUNTIF(INDIRECT(\"'\"&$I153&\"'!$D$5:$D$80\"),L$1)>0,1,\"\"))","v":""},"","","","","","","","","","","","","","","","","","","","","","","","","","","","","","","","","",""]
[null,null,null,null,null,null,null,null,{"$f":"IF(Données!A155=\"\",\"\",Données!A155)","v":""},"","","","","","","","","","","","","","","","","","","","","","","","","","","","","","","","","","","","",""]
[null,null,null,null,null,null,null,null,{"$f":"IF(Données!A156=\"\",\"\",Données!A156)","v":""},"","","","","","","","","","","","","","","","","","","","","","","","","","","","","","","","","","","","",""]
[null,null,null,null,null,null,null,null,{"$f":"IF(Données!A157=\"\",\"\",Données!A157)","v":""},"","","","","","","","","","","","","","","","","","","","","","","","","","","","","","","","","","","","",""]
[null,null,null,null,null,null,null,null,{"$f":"IF(Données!A158=\"\",\"\",Données!A158)","v":""},"","","","","","","","","","","","","","","","","","","","","","","","","","","","","",{"$f":"IF(AM$1=\"\",\"\",IF(ISERROR(IF(COUNTIF(INDIRECT(\"'\"&$I157&\"'!$D$5:$D$80\"),AM$1)>0,1,\"\")),\"\",IF(COUNTIF(INDIRECT(\"'\"&$I157&\"'!$D$5:$D$80\"),AM$1)>0,1,\"\")))","v":""},"","","","","","",""]
[null,null,null,null,null,null,null,null,{"$f":"IF(Données!A159=\"\",\"\",Données!A159)","v":""},"","","","","","","","","","","","","","","","","","","","","","","","","","","","","","","","","","","","",""]
[null,null,null,null,null,null,null,null,{"$f":"IF(Données!A160=\"\",\"\",Données!A160)","v":""},"","","","","","","","","","","","","","","","","","","","","","","","","","","","","","","","","","","","",""]
[null,null,null,null,null,null,null,null,{"$f":"IF(Données!A161=\"\",\"\",Données!A161)","v":""},"","","","","","","","","","","","","","","","","","","","","","","","","","","","","","","","","","","","",""]
[null,null,null,null,null,null,null,null,{"$f":"IF(Données!A162=\"\",\"\",Données!A162)","v":""},"","","","","","","","","","","","","","","","","","",{"$f":"IF(ISERROR(IF(COUNTIF(INDIRECT(\"'\"&$I161&\"'!$D$5:$D$80\"),AB$1)>0,1,\"\")),\"\",IF(COUNTIF(INDIRECT(\"'\"&$I161&\"'!$D$5:$D$80\"),AB$1)>0,1,\"\"))","v":""},"","","","","","","","","","","","","","","","","",""]
[null,null,null,null,null,null,null,null,{"$f":"IF(Données!A163=\"\",\"\",Données!A163)","v":""},"","","","","","","","","","","","","","","","","","","","","","","","","","","","","","","","","","","","",""]
[null,null,null,null,null,null,null,null,{"$f":"IF(Données!A164=\"\",\"\",Données!A164)","v":""},"","","","","","","","","","","","","","","","","","","","","","","","","","","","","","","","","","","","",""]
[null,null,null,null,null,null,null,null,{"$f":"IF(Données!A165=\"\",\"\",Données!A165)","v":""},"","","","","","","","","","","","","","","","","","","","","","","","","","","","","","","","","","","","",""]
[null,null,null,null,null,null,null,null,{"$f":"IF(Données!A166=\"\",\"\",Données!A166)","v":""},"","","","","","","","","","","","","","","","","","","","","","","","","","","","","","","","","","","","",""]
[null,null,null,null,null,null,null,null,{"$f":"IF(Données!A167=\"\",\"\",Données!A167)","v":""},"","","","","","","","","","","","","","","","","","","","","","","","","","","","","","","","","","","","",""]
[null,null,null,null,null,null,null,null,{"$f":"IF(Données!A168=\"\",\"\",Données!A168)","v":""},"","","","","","","","","","","","","","","","","","","","","","","","","","","","","","","","","","","","",""]
[null,null,null,null,null,null,null,null,{"$f":"IF(Données!A169=\"\",\"\",Données!A169)","v":""},"","","","","","","","","","","","","","","","","",{"$f":"IF(ISERROR(IF(COUNTIF(INDIRECT(\"'\"&$I168&\"'!$D$5:$D$80\"),AA$1)>0,1,\"\")),\"\",IF(COUNTIF(INDIRECT(\"'\"&$I168&\"'!$D$5:$D$80\"),AA$1)>0,1,\"\"))","v":""},"","","","","","","","","","","","","","","","","","",""]
[null,null,null,null,null,null,null,null,{"$f":"IF(Données!A170=\"\",\"\",Données!A170)","v":""},"",{"$f":"IF(ISERROR(INDIRECT(\"'\"&$I169&\"'!$j$77\")),\"\",INDIRECT(\"'\"&$I169&\"'!$j$77\"))","v":""},{"$f":"IF(ISERROR(IF(COUNTIF(INDIRECT(\"'\"&$I169&\"'!$D$5:$D$80\"),L$1)>0,1,\"\")),\"\",IF(COUNTIF(INDIRECT(\"'\"&$I169&\"'!$D$5:$D$80\"),L$1)>0,1,\"\"))","v":""},"","","","","","","","","","","","","","","","","","","","","","","","","","","","","","","","","",""]
[null,null,null,null,null,null,null,null,{"$f":"IF(Données!A171=\"\",\"\",Données!A171)","v":""},"","","","","","","","","","","","","","","","","","","","","","","","","","","","","","","","","","","","",""]
[null,null,null,null,null,null,null,null,{"$f":"IF(Données!A172=\"\",\"\",Données!A172)","v":""},"","","","","","","","","","","","","","","","","","","","","","","","","","","","","","","","","","","","",""]
[null,null,null,null,null,null,null,null,{"$f":"IF(Données!A173=\"\",\"\",Données!A173)","v":""},"","","","","","","","","","","","","","","","","","","","","","","","","","","","","","","","","","","","",""]
[null,null,null,null,null,null,null,null,{"$f":"IF(Données!A174=\"\",\"\",Données!A174)","v":""},"","","","","","","","","","","","","","","","","","","","","","","","","","","","","","","","","","","","",""]
[null,null,null,null,null,null,null,null,{"$f":"IF(Données!A175=\"\",\"\",Données!A175)","v":""},"","","","","","","","","","","","","","","","","","","","","","","","","","","","","","","","","","","","",""]
[null,null,null,null,null,null,null,null,{"$f":"IF(Données!A176=\"\",\"\",Données!A176)","v":""},"","","","","","","","","","","","","","","","","","","","","","","","","","","","","","","","","","","","",""]
[null,null,null,null,null,null,null,null,{"$f":"IF(Données!A177=\"\",\"\",Données!A177)","v":""},"","","","","","","","","","","","","","","","","","","","","","","","","","","","","","","","","","","","",""]
[null,null,null,null,null,null,null,null,{"$f":"IF(Données!A178=\"\",\"\",Données!A178)","v":""},"","","","","","","","","","","","","","","","","","","","","","","","","","","","","","","","","","","","",""]
[null,null,null,null,null,null,null,null,{"$f":"IF(Données!A179=\"\",\"\",Données!A179)","v":""},"","","","","","","","","","","","","","","","","","","","","","","","","","","","","","","","","","","","",""]
[null,null,null,null,null,null,null,null,{"$f":"IF(Données!A180=\"\",\"\",Données!A180)","v":""},"","","","","","","","","","","","","","","","","","","","","","","","","","","","","","","","","","","","",""]
[null,null,null,null,null,null,null,null,{"$f":"IF(Données!A181=\"\",\"\",Données!A181)","v":""},"","","","","","","","","","","","","","","","","","","","","","","","","","","","","","","","","","","","",""]
[null,null,null,null,null,null,null,null,{"$f":"IF(Données!A182=\"\",\"\",Données!A182)","v":""},"","","","","","","","","","","","","","","","","","","","","","","","","","","","","","","","","","","","",""]
[null,null,null,null,null,null,null,null,{"$f":"IF(Données!A183=\"\",\"\",Données!A183)","v":""},"","","","","","","","","","","","","","","","","","","","","","","","","","","","","","","","","","","","",""]
[null,null,null,null,null,null,null,null,{"$f":"IF(Données!A184=\"\",\"\",Données!A184)","v":""},"","","","","","","","","","","","","","","","","","","","","","","","","","","","","","","","","","","","",""]
[null,null,null,null,null,null,null,null,{"$f":"IF(Données!A185=\"\",\"\",Données!A185)","v":""},"","","","","","","","","","","","","","","","","",{"$f":"IF(ISERROR(IF(COUNTIF(INDIRECT(\"'\"&$I184&\"'!$D$5:$D$80\"),AA$1)>0,1,\"\")),\"\",IF(COUNTIF(INDIRECT(\"'\"&$I184&\"'!$D$5:$D$80\"),AA$1)>0,1,\"\"))","v":""},"","","","","","","","","","","","","","","","","","",""]
[null,null,null,null,null,null,null,null,{"$f":"IF(Données!A186=\"\",\"\",Données!A186)","v":""},"","",{"$f":"IF(ISERROR(IF(COUNTIF(INDIRECT(\"'\"&$I185&\"'!$D$5:$D$80\"),L$1)>0,1,\"\")),\"\",IF(COUNTIF(INDIRECT(\"'\"&$I185&\"'!$D$5:$D$80\"),L$1)>0,1,\"\"))","v":""},"","","","","","","","","","","","","","","","","","","","","","","","","","","","","",{"$f":"IF(AP$1=\"\",\"\",IF(ISERROR(IF(COUNTIF(INDIRECT(\"'\"&$I185&\"'!$D$5:$D$80\"),AP$1)>0,1,\"\")),\"\",IF(COUNTIF(INDIRECT(\"'\"&$I185&\"'!$D$5:$D$80\"),AP$1)>0,1,\"\")))","v":""},"","","",""]
[null,null,null,null,null,null,null,null,{"$f":"IF(Données!A187=\"\",\"\",Données!A187)","v":""},"","","","","","","","","","","","","","","","","","","","","","","","","","","","","","","","","","","","",""]
[null,null,null,null,null,null,null,null,{"$f":"IF(Données!A188=\"\",\"\",Données!A188)","v":""},"","","","","","","","","","","","","","","","","","","","","","","","","","","","","","","","","","","","",""]
[null,null,null,null,null,null,null,null,{"$f":"IF(Données!A189=\"\",\"\",Données!A189)","v":""},"","","","","","","","","","","","","","","","","","","","","","","","","","","","","","","","","","","","",""]
[null,null,null,null,null,null,null,null,{"$f":"IF(Données!A190=\"\",\"\",Données!A190)","v":""},"","","","","","","","","","","","","","","","","","","","","","","","","","","","","","","","","","","","",""]
[null,null,null,null,null,null,null,null,{"$f":"IF(Données!A191=\"\",\"\",Données!A191)","v":""},"","","","","","","","","","","","","","","","","","","","","","","","","","","","","","","","","","","","",""]
[null,null,null,null,null,null,null,null,{"$f":"IF(Données!A192=\"\",\"\",Données!A192)","v":""},"","","","","","","","","","","","","","","","","","","","","","","","","","","","","","","","","","","","",""]
[null,null,null,null,null,null,null,null,{"$f":"IF(Données!A193=\"\",\"\",Données!A193)","v":""},"","","","","","","","","","","","","","","","","","","","","","","","","","","","","","","","","","","","",""]
[null,null,null,null,null,null,null,null,{"$f":"IF(Données!A194=\"\",\"\",Données!A194)","v":""},"","","","","","","","","","","","","","","","","","","","","","","","","","","","","","","","","","","","",""]
[null,null,null,null,null,null,null,null,{"$f":"IF(Données!A195=\"\",\"\",Données!A195)","v":""},"","","","","","","","","","","","","","","","","","","","","","","","","","","","","","","","","","","","",""]
[null,null,null,null,null,null,null,null,{"$f":"IF(Données!A196=\"\",\"\",Données!A196)","v":""},{"$f":"IF(SUM(L195:AT195)=0,\"\",SUM(L195:AT195))","v":""},"","","","","","","","","","","","","","","","","","","","","","","","","","","","","","","","","","","",""]
[null,null,null,null,null,null,null,null,{"$f":"IF(Données!A197=\"\",\"\",Données!A197)","v":""},"","","","","","","","","","","","","","","","","","","","","","","","","","","","","","","","","","","","",""]
[null,null,null,null,null,null,null,null,{"$f":"IF(Données!A198=\"\",\"\",Données!A198)","v":""},"","","","","","","","","","","","","","","","","","","","","","","","","","","","","","","","","","","","",""]
[null,null,null,null,null,null,null,null,{"$f":"IF(Données!A199=\"\",\"\",Données!A199)","v":""},"","","","","","","","","","","","","","","","","","","","","","","","","","","","","","","","","","","","",""]
[null,null,null,null,null,null,null,null,{"$f":"IF(Données!A200=\"\",\"\",Données!A200)","v":""},"","","","","","","","","","","","","","","","","","","","","","","","","","","","","","","","","","","","",""]
[null,null,null,null,null,null,null,null,{"$f":"IF(Données!A201=\"\",\"\",Données!A201)","v":""},"","","","","","","","","","","","","","","","","",{"$f":"IF(ISERROR(IF(COUNTIF(INDIRECT(\"'\"&$I200&\"'!$D$5:$D$80\"),AA$1)>0,1,\"\")),\"\",IF(COUNTIF(INDIRECT(\"'\"&$I200&\"'!$D$5:$D$80\"),AA$1)>0,1,\"\"))","v":""},"","","","","","","","","","","","","","","","","","",""]
[null,null,null,null,null,null,null,null,{"$f":"IF(Données!A202=\"\",\"\",Données!A202)","v":""},"","",{"$f":"IF(ISERROR(IF(COUNTIF(INDIRECT(\"'\"&$I201&\"'!$D$5:$D$80\"),L$1)>0,1,\"\")),\"\",IF(COUNTIF(INDIRECT(\"'\"&$I201&\"'!$D$5:$D$80\"),L$1)>0,1,\"\"))","v":""},"","","","","","","","","","","","","","","","","","","","","","","","","","","","","","","","","",""]
[null,null,null,null,null,null,null,null,{"$f":"IF(Données!A203=\"\",\"\",Données!A203)","v":""},"","","","","","","","","","","","","","","","","","","","","","","","","","","","","","","","","","","","",""]
[null,null,null,null,null,null,null,null,{"$f":"IF(Données!A204=\"\",\"\",Données!A204)","v":""},"","","","","","","","","","","","","","","","","","","","","","","","","","","","","","","","","","","","",""]
[null,null,null,null,null,null,null,null,{"$f":"IF(Données!A205=\"\",\"\",Données!A205)","v":""},"","","","","","","","","","","","","","","","","","","","","","","","","","","","","","","","","","","","",""]
[null,null,null,null,null,null,null,null,{"$f":"IF(Données!A206=\"\",\"\",Données!A206)","v":""},"","","","","","","","","","","","","","","","","","","","","","","","","","","","","","","","","","","","",""]
[null,null,null,null,null,null,null,null,{"$f":"IF(Données!A207=\"\",\"\",Données!A207)","v":""},"","","","","","","","","","","","","","","","","","","","","","","","","","","","","","","","","","","","",""]
[null,null,null,null,null,null,null,null,{"$f":"IF(Données!A208=\"\",\"\",Données!A208)","v":""},"","","","","","","","","","","","","","","","","","","","","","","","","","","","","","","","","","","","",""]
[null,null,null,null,null,null,null,null,{"$f":"IF(Données!A209=\"\",\"\",Données!A209)","v":""},"","","","","","","","","","","","","","","","","","","","","","","","","","","","","","","","","","","","",""]
[null,null,null,null,null,null,null,null,{"$f":"IF(Données!A210=\"\",\"\",Données!A210)","v":""},"","","","","","","","","","","","","","","","","","","","","","","","","","","","","","","","","","","","",""]
[null,null,null,null,null,null,null,null,{"$f":"IF(Données!A211=\"\",\"\",Données!A211)","v":""},"","","","","","","","","","","","","","","","","","","","","","","","","","","","","","","","","","","","",""]
[null,null,null,null,null,null,null,null,{"$f":"IF(Données!A212=\"\",\"\",Données!A212)","v":""},"","","","","","","","","","","","","","","","","","","","","","","","","","","","","","","","","","","","",""]
[null,null,null,null,null,null,null,null,{"$f":"IF(Données!A213=\"\",\"\",Données!A213)","v":""},"","","","","","","","","","","","","","","","","","","","","","","","","","","","","","","","","","","","",""]
[null,null,null,null,null,null,null,null,{"$f":"IF(Données!A214=\"\",\"\",Données!A214)","v":""},"","","","","","","","","","","","","","","","","","","","","","","","","","","","","","","","","","","",{"$f":"IF(AS$1=\"\",\"\",IF(ISERROR(IF(COUNTIF(INDIRECT(\"'\"&$I213&\"'!$D$5:$D$80\"),AS$1)>0,1,\"\")),\"\",IF(COUNTIF(INDIRECT(\"'\"&$I213&\"'!$D$5:$D$80\"),AS$1)>0,1,\"\")))","v":""},""]
[null,null,null,null,null,null,null,null,{"$f":"IF(Données!A215=\"\",\"\",Données!A215)","v":""},"","","","","","","","","","","","","","","","","","","","","","","","","","","","","","","","","","","","",""]
[null,null,null,null,null,null,null,null,{"$f":"IF(Données!A216=\"\",\"\",Données!A216)","v":""},"","","","","","","","","","","","","","","","","","","","","","","","","","","","","","","","","","","","",""]
[null,null,null,null,null,null,null,null,{"$f":"IF(Données!A217=\"\",\"\",Données!A217)","v":""},"","","","","","","","","","","","","","","","","",{"$f":"IF(ISERROR(IF(COUNTIF(INDIRECT(\"'\"&$I216&\"'!$D$5:$D$80\"),AA$1)>0,1,\"\")),\"\",IF(COUNTIF(INDIRECT(\"'\"&$I216&\"'!$D$5:$D$80\"),AA$1)>0,1,\"\"))","v":""},"","","","","","","","","","","","","","","","","","",""]
[null,null,null,null,null,null,null,null,{"$f":"IF(Données!A218=\"\",\"\",Données!A218)","v":""},"","",{"$f":"IF(ISERROR(IF(COUNTIF(INDIRECT(\"'\"&$I217&\"'!$D$5:$D$80\"),L$1)>0,1,\"\")),\"\",IF(COUNTIF(INDIRECT(\"'\"&$I217&\"'!$D$5:$D$80\"),L$1)>0,1,\"\"))","v":""},"","","","","","","","","","","","","","","","","","","","","","","","","","","","","","","","","",""]
[null,null,null,null,null,null,null,null,{"$f":"IF(Données!A219=\"\",\"\",Données!A219)","v":""},"","","","","","","","","","","","","","","","","","","","","","","","","","","","","","","","","","","","",""]
[null,null,null,null,null,null,null,null,{"$f":"IF(Données!A220=\"\",\"\",Données!A220)","v":""},"","","","","","","","","","","","","","","","","","","","","","","","","","","","","","","","","","","","",""]
[null,null,null,null,null,null,null,null,{"$f":"IF(Données!A221=\"\",\"\",Données!A221)","v":""},"","","","","","","","","","","","","","","","","","","","","","","","","","","","","","","","","","","","",""]
[null,null,null,null,null,null,null,null,{"$f":"IF(Données!A222=\"\",\"\",Données!A222)","v":""},"","","","","","","","","","","","","","","","","","","","","","","","","","","","","","","","","","","","",""]
[null,null,null,null,null,null,null,null,{"$f":"IF(Données!A223=\"\",\"\",Données!A223)","v":""},"","","","","","","","","","","","","","","","","","","","","","","","","","","","","","","","","","","","",""]
[null,null,null,null,null,null,null,null,{"$f":"IF(Données!A224=\"\",\"\",Données!A224)","v":""},"","","","","","","","","","","","","","","","","","","","","","","","","","","","","","","","","","","","",""]
[null,null,null,null,null,null,null,null,{"$f":"IF(Données!A225=\"\",\"\",Données!A225)","v":""},"","","","","","","","","","","","","","","","","","","","","","","","","","","","","","","","","","","","",""]
[null,null,null,null,null,null,null,null,{"$f":"IF(Données!A226=\"\",\"\",Données!A226)","v":""},"","","","","","","","","","","","","","","","","","","","","","","","","","","","","","","","","","","","",""]
[null,null,null,null,null,null,null,null,{"$f":"IF(Données!A227=\"\",\"\",Données!A227)","v":""},"","","","","","","","","","","","","","","","","","","","","","","","","","","","","","","","","","","","",""]
[null,null,null,null,null,null,null,null,{"$f":"IF(Données!A228=\"\",\"\",Données!A228)","v":""},"","","","","","","","","","","","","","","","","","","","","","","","","","","","","","","","","","","","",""]
[null,null,null,null,null,null,null,null,{"$f":"IF(Données!A229=\"\",\"\",Données!A229)","v":""},"","","","","","","","","","","","","","","","","","","","","","","","","","","","","","","","","","","","",""]
[null,null,null,null,null,null,null,null,{"$f":"IF(Données!A230=\"\",\"\",Données!A230)","v":""},"","","","","","","","","","","","","","","","","","","","","","","","","","","","","","","","","","","","",""]
[null,null,null,null,null,null,null,null,{"$f":"IF(Données!A231=\"\",\"\",Données!A231)","v":""},"","","","","","","","","","","","","","","","","","","","","","","","","","","","","","","","","","","","",""]
[null,null,null,null,null,null,null,null,{"$f":"IF(Données!A232=\"\",\"\",Données!A232)","v":""},"","","","","","","","","","","","","","","","","","","","","","","","","","","","","","","","","","","","",""]
[null,null,null,null,null,null,null,null,{"$f":"IF(Données!A233=\"\",\"\",Données!A233)","v":""},"","","","","","","","","","","","","","","","","",{"$f":"IF(ISERROR(IF(COUNTIF(INDIRECT(\"'\"&$I232&\"'!$D$5:$D$80\"),AA$1)>0,1,\"\")),\"\",IF(COUNTIF(INDIRECT(\"'\"&$I232&\"'!$D$5:$D$80\"),AA$1)>0,1,\"\"))","v":""},"","","","","","","","","","","","","","","","","","",""]
[null,null,null,null,null,null,null,null,{"$f":"IF(Données!A234=\"\",\"\",Données!A234)","v":""},"",{"$f":"IF(ISERROR(INDIRECT(\"'\"&$I233&\"'!$j$77\")),\"\",INDIRECT(\"'\"&$I233&\"'!$j$77\"))","v":""},{"$f":"IF(ISERROR(IF(COUNTIF(INDIRECT(\"'\"&$I233&\"'!$D$5:$D$80\"),L$1)>0,1,\"\")),\"\",IF(COUNTIF(INDIRECT(\"'\"&$I233&\"'!$D$5:$D$80\"),L$1)>0,1,\"\"))","v":""},"","","","","","","","","","","","","","","","","","","","","","","","","","","","","","","","","",""]
[null,null,null,null,null,null,null,null,{"$f":"IF(Données!A235=\"\",\"\",Données!A235)","v":""},"","","","","","","","","","","","","","","","","","","","","","","","","","","","","","","","","","","","",""]
[null,null,null,null,null,null,null,null,{"$f":"IF(Données!A236=\"\",\"\",Données!A236)","v":""},"","","","","","","","","","","","","","","","","","","","","","","","","","","","","","","","","","","","",""]
[null,null,null,null,null,null,null,null,{"$f":"IF(Données!A237=\"\",\"\",Données!A237)","v":""},"","","","","","","","","","","","","","","","","","","","","","","","","","","","","","","","","","","","",""]
[null,null,null,null,null,null,null,null,{"$f":"IF(Données!A238=\"\",\"\",Données!A238)","v":""},"","","","","","","","","","","","","","","","","","","","","","","","","","","","","","","","","","","","",""]
[null,null,null,null,null,null,null,null,{"$f":"IF(Données!A239=\"\",\"\",Données!A239)","v":""},"","","","","","","","","","","","","","","","","","","","","","","","","","","","","","","","","","","","",""]
[null,null,null,null,null,null,null,null,{"$f":"IF(Données!A240=\"\",\"\",Données!A240)","v":""},"","","","","","","","","","","","","","","","","","","","","","","","","","","","","","","","","","","","",""]
[null,null,null,null,null,null,null,null,{"$f":"IF(Données!A241=\"\",\"\",Données!A241)","v":""},"","","","","","","","","","","","","","","","","","","","","","","","","","","","","","","","","","","","",""]
[null,null,null,null,null,null,null,null,{"$f":"IF(Données!A242=\"\",\"\",Données!A242)","v":""},"","","","","","","","","","","","","","","","","","","","","","","","","","","","","","","","","","","","",""]
[null,null,null,null,null,null,null,null,{"$f":"IF(Données!A243=\"\",\"\",Données!A243)","v":""},"","","","","","","","","","","","","","","","","","","","","","","","","","","","","",{"$f":"IF(AM$1=\"\",\"\",IF(ISERROR(IF(COUNTIF(INDIRECT(\"'\"&$I242&\"'!$D$5:$D$80\"),AM$1)>0,1,\"\")),\"\",IF(COUNTIF(INDIRECT(\"'\"&$I242&\"'!$D$5:$D$80\"),AM$1)>0,1,\"\")))","v":""},"","","","","","",""]
[null,null,null,null,null,null,null,null,{"$f":"IF(Données!A244=\"\",\"\",Données!A244)","v":""},"","","","","","","","","","","","","","","","","","","","","","","","","","","","","","","","","","","","",""]
[null,null,null,null,null,null,null,null,{"$f":"IF(Données!A245=\"\",\"\",Données!A245)","v":""},"","","","","","","","","","","","","","","","","","","","","","","","","","","","","","","","","","","","",""]
[null,null,null,null,null,null,null,null,{"$f":"IF(Données!A246=\"\",\"\",Données!A246)","v":""},"","","","","","","","","","","","","","","","","","","","","","","","","","","","","","","","","","","","",""]
[null,null,null,null,null,null,null,null,{"$f":"IF(Données!A247=\"\",\"\",Données!A247)","v":""},"","","","","","","","","","","","","","","","","","","","","","","","","","","","","","","","","","","","",""]
[null,null,null,null,null,null,null,null,{"$f":"IF(Données!A248=\"\",\"\",Données!A248)","v":""},"","","","","","","","","","","","","","","","","","","","","","","","","","","","","","","","","","","","",""]
[null,null,null,null,null,null,null,null,{"$f":"IF(Données!A249=\"\",\"\",Données!A249)","v":""},"","","","","","","","","","","","","","","","","",{"$f":"IF(ISERROR(IF(COUNTIF(INDIRECT(\"'\"&$I248&\"'!$D$5:$D$80\"),AA$1)>0,1,\"\")),\"\",IF(COUNTIF(INDIRECT(\"'\"&$I248&\"'!$D$5:$D$80\"),AA$1)>0,1,\"\"))","v":""},"","","","","","","","","","","","","","","","","","",""]
[null,null,null,null,null,null,null,null,{"$f":"IF(Données!A250=\"\",\"\",Données!A250)","v":""},"","",{"$f":"IF(ISERROR(IF(COUNTIF(INDIRECT(\"'\"&$I249&\"'!$D$5:$D$80\"),L$1)>0,1,\"\")),\"\",IF(COUNTIF(INDIRECT(\"'\"&$I249&\"'!$D$5:$D$80\"),L$1)>0,1,\"\"))","v":""},"","","","","","","","","","","","","","","","","","","","","","","","","","","","","","","","","",""]
[null,null,null,null,null,null,null,null,{"$f":"IF(Données!A251=\"\",\"\",Données!A251)","v":""},"","","","","","","","","","","","","","","","","","","","","","","","","","","","","","","","","","","","",""]
[null,null,null,null,null,null,null,null,{"$f":"IF(Données!A252=\"\",\"\",Données!A252)","v":""},"","","","","","","","","","","","","","","","","","","","","","","","","","","","","","","","","","","","",""]
[null,null,null,null,null,null,null,null,{"$f":"IF(Données!A253=\"\",\"\",Données!A253)","v":""},"","","","","","","","","","","","","","","","","","","","","","","","","","","","","","","","","","","","",""]
[null,null,null,null,null,null,null,null,{"$f":"IF(Données!A254=\"\",\"\",Données!A254)","v":""},"","","","","","","","","","","","","","","","","","","","","","","","","","","","","","","","","","","","",""]
[null,null,null,null,null,null,null,null,{"$f":"IF(Données!A255=\"\",\"\",Données!A255)","v":""},"","","","","","","","","","","","","","","","","","","","","","","","","","","","","","","","","","","","",""]
[null,null,null,null,null,null,null,null,{"$f":"IF(Données!A256=\"\",\"\",Données!A256)","v":""},"","","","","","","","","","","","","","","","","","","","","","","","","","","","","","","","","","","","",""]
[null,null,null,null,null,null,null,null,{"$f":"IF(Données!A257=\"\",\"\",Données!A257)","v":""},"","","","","","","","","","","","","","","","","","","","","","","","","","","","","","","","","","","","",""]
[null,null,null,null,null,null,null,null,{"$f":"IF(Données!A258=\"\",\"\",Données!A258)","v":""},"","","","","","","","","","","","","","","","","","","","","","","","","","","","","","","","","","","","",""]
[null,null,null,null,null,null,null,null,{"$f":"IF(Données!A259=\"\",\"\",Données!A259)","v":""},"","","","","","","","","","","","","","","","","","","","","","","","","","","","","","","","","","","","",""]
[null,null,null,null,null,null,null,null,{"$f":"IF(Données!A260=\"\",\"\",Données!A260)","v":""},{"$f":"IF(SUM(L259:AT259)=0,\"\",SUM(L259:AT259))","v":""},"","","","","","","","","","","","","","","","","","","","","","","","","","","","","","","","","","","",""]
[null,null,null,null,null,null,null,null,{"$f":"IF(Données!A261=\"\",\"\",Données!A261)","v":""},"","","","","","","","","","","","","","","","","","","","","","","","","","","","","","","","","","","","",""]
[null,null,null,null,null,null,null,null,{"$f":"IF(Données!A262=\"\",\"\",Données!A262)","v":""},"","","","","","","","","","","","","","","","","","","","","","","","","","","","","","","","","","","","",""]
[null,null,null,null,null,null,null,null,{"$f":"IF(Données!A263=\"\",\"\",Données!A263)","v":""},"","","","","","","","","","","","","","","","","","","","","","","","","","","","","","","","","","","","",""]
[null,null,null,null,null,null,null,null,{"$f":"IF(Données!A264=\"\",\"\",Données!A264)","v":""},"","","","","","","","","","","","","","","","","","","","","","","","","","","","","","","","","","","","",""]
[null,null,null,null,null,null,null,null,{"$f":"IF(Données!A265=\"\",\"\",Données!A265)","v":""},"","","","","","","","","","","","","","","","","",{"$f":"IF(ISERROR(IF(COUNTIF(INDIRECT(\"'\"&$I264&\"'!$D$5:$D$80\"),AA$1)>0,1,\"\")),\"\",IF(COUNTIF(INDIRECT(\"'\"&$I264&\"'!$D$5:$D$80\"),AA$1)>0,1,\"\"))","v":""},"","","","","","","","","","","","","","","","","","",""]
[null,null,null,null,null,null,null,null,{"$f":"IF(Données!A266=\"\",\"\",Données!A266)","v":""},"","",{"$f":"IF(ISERROR(IF(COUNTIF(INDIRECT(\"'\"&$I265&\"'!$D$5:$D$80\"),L$1)>0,1,\"\")),\"\",IF(COUNTIF(INDIRECT(\"'\"&$I265&\"'!$D$5:$D$80\"),L$1)>0,1,\"\"))","v":""},"","","","","","","","","","","","","","","","","","","","","","","","","","","","","","","","","",""]
[null,null,null,null,null,null,null,null,{"$f":"IF(Données!A267=\"\",\"\",Données!A267)","v":""},"","","","","","","","","","","","","","","","","","","","","","","","","","","","","","","","","","","","",""]
[null,null,null,null,null,null,null,null,{"$f":"IF(Données!A268=\"\",\"\",Données!A268)","v":""},"","","","","","","","","","","","","","","","","","","","","","","","","","","","","","","","","","","","",""]
[null,null,null,null,null,null,null,null,{"$f":"IF(Données!A269=\"\",\"\",Données!A269)","v":""},"","","","","","","","","","","","","","","","","","","","","","","","","","","","","","","","","","","","",""]
[null,null,null,null,null,null,null,null,{"$f":"IF(Données!A270=\"\",\"\",Données!A270)","v":""},"","","","","","","","","","","","","","","","","","","","","","","","","","","","","","","","","","","","",""]
[null,null,null,null,null,null,null,null,{"$f":"IF(Données!A271=\"\",\"\",Données!A271)","v":""},"","","","","","","","","","","","","","","","","","","","","","","","","","","","","","","","",{"$f":"IF(AP$1=\"\",\"\",IF(ISERROR(IF(COUNTIF(INDIRECT(\"'\"&$I270&\"'!$D$5:$D$80\"),AP$1)>0,1,\"\")),\"\",IF(COUNTIF(INDIRECT(\"'\"&$I270&\"'!$D$5:$D$80\"),AP$1)>0,1,\"\")))","v":""},"","","",""]
[null,null,null,null,null,null,null,null,{"$f":"IF(Données!A272=\"\",\"\",Données!A272)","v":""},"","","","","","","","","","","","","","","","","","","","","","","","","","","","","","","","","","","","",""]
[null,null,null,null,null,null,null,null,{"$f":"IF(Données!A273=\"\",\"\",Données!A273)","v":""},"","","","","","","","","","","","","","","","","","","","","","","","","","","","","","","","","","","","",""]
[null,null,null,null,null,null,null,null,{"$f":"IF(Données!A274=\"\",\"\",Données!A274)","v":""},"","","","","","","","","","","","","","","","","","","","","","","","","","","","","","","","","","","","",""]
[null,null,null,null,null,null,null,null,{"$f":"IF(Données!A275=\"\",\"\",Données!A275)","v":""},"","","","","","","","","","","","","","","","","","","","","","","","","","","","","","","","","","","","",""]
[null,null,null,null,null,null,null,null,{"$f":"IF(Données!A276=\"\",\"\",Données!A276)","v":""},"","","","","","","","","","","","","","","","","","","","","","","","","","","","","","","","","","","","",""]
[null,null,null,null,null,null,null,null,{"$f":"IF(Données!A277=\"\",\"\",Données!A277)","v":""},"","","","","","","","","","","","","","","","","","","","","","","","","","","","","","","","","","","","",""]
[null,null,null,null,null,null,null,null,{"$f":"IF(Données!A278=\"\",\"\",Données!A278)","v":""},"","","","","","","","","","","","","","","","","","","","","","","","","","","","","","","","","","","","",""]
[null,null,null,null,null,null,null,null,{"$f":"IF(Données!A279=\"\",\"\",Données!A279)","v":""},"","","","","","","","","","","","","","","","","","","","","","","","","","","","","","","","","","","","",""]
[null,null,null,null,null,null,null,null,{"$f":"IF(Données!A280=\"\",\"\",Données!A280)","v":""},"","","",{"$f":"IF(ISERROR(IF(COUNTIF(INDIRECT(\"'\"&$I279&\"'!$D$5:$D$80\"),M$1)>0,1,\"\")),\"\",IF(COUNTIF(INDIRECT(\"'\"&$I279&\"'!$D$5:$D$80\"),M$1)>0,1,\"\"))","v":""},"","","","","","","","","","","","","","","","","","","","","","","","","","","","","","","","",""]
[null,null,null,null,null,null,null,null,{"$f":"IF(Données!A281=\"\",\"\",Données!A281)","v":""},"","","","","","","","","","","","","","","","","","","","","","","","","","","","","","","","","","","","",""]
[null,null,null,null,null,null,null,null,{"$f":"IF(Données!A282=\"\",\"\",Données!A282)","v":""},"","","","","","","","","","","","","","","","","","","","","","","","","","","","","","","","","","","","",""]
[null,null,null,null,null,null,null,null,{"$f":"IF(Données!A283=\"\",\"\",Données!A283)","v":""},"","","","","","","","","","","","","","","","","","","","","","","","","","","","","","","","","","","","",""]
[null,null,null,null,null,null,null,null,{"$f":"IF(Données!A284=\"\",\"\",Données!A284)","v":""},"","","","","","","","","","","","","","","","","","","","","","","","","","","","","","","","","","","","",""]
[null,null,null,null,null,null,null,null,{"$f":"IF(Données!A285=\"\",\"\",Données!A285)","v":""},"","","","","","","","","","","","","","","","","","","","","","","","","","","","","","","","","","","","",""]
[null,null,null,null,null,null,null,null,{"$f":"IF(Données!A286=\"\",\"\",Données!A286)","v":""},"","","","","","","","","","","","","","","","","","","","","","","","","","","","","","","","","","","","",""]
[null,null,null,null,null,null,null,null,{"$f":"IF(Données!A287=\"\",\"\",Données!A287)","v":""},"","","","","","","","","","","","","","","","","","","",{"$f":"IF(ISERROR(IF(COUNTIF(INDIRECT(\"'\"&$I286&\"'!$D$5:$D$80\"),AC$1)>0,1,\"\")),\"\",IF(COUNTIF(INDIRECT(\"'\"&$I286&\"'!$D$5:$D$80\"),AC$1)>0,1,\"\"))","v":""},"","","","","","","","","","","","","","","","",""]
[null,null,null,null,null,null,null,null,{"$f":"IF(Données!A288=\"\",\"\",Données!A288)","v":""},"","","","","","","","","","","","","","","","","","",{"$f":"IF(ISERROR(IF(COUNTIF(INDIRECT(\"'\"&$I287&\"'!$D$5:$D$80\"),AB$1)>0,1,\"\")),\"\",IF(COUNTIF(INDIRECT(\"'\"&$I287&\"'!$D$5:$D$80\"),AB$1)>0,1,\"\"))","v":""},"","","","","","","","","","","","","","","","","",""]
[null,null,null,null,null,null,null,null,{"$f":"IF(Données!A289=\"\",\"\",Données!A289)","v":""},"","","","","","","","","",{"$f":"IF(ISERROR(IF(COUNTIF(INDIRECT(\"'\"&$I288&\"'!$D$5:$D$80\"),S$1)>0,1,\"\")),\"\",IF(COUNTIF(INDIRECT(\"'\"&$I288&\"'!$D$5:$D$80\"),S$1)>0,1,\"\"))","v":""},"","","","","","","","","","","","","","","","","","","","","","","","","","",""]
[null,null,null,null,null,null,null,null,{"$f":"IF(Données!A290=\"\",\"\",Données!A290)","v":""},"","",{"$f":"IF(ISERROR(IF(COUNTIF(INDIRECT(\"'\"&$I289&\"'!$D$5:$D$80\"),L$1)>0,1,\"\")),\"\",IF(COUNTIF(INDIRECT(\"'\"&$I289&\"'!$D$5:$D$80\"),L$1)>0,1,\"\"))","v":""},"","","","","","","","","","","","","","","","","","","","","","","","","","","","","","","","","",""]
[null,null,null,null,null,null,null,null,{"$f":"IF(Données!A291=\"\",\"\",Données!A291)","v":""},"","","","","","","","","","","","","","","","","","","","","","","","","","","","","","","","","","","","",""]
[null,null,null,null,null,null,null,null,{"$f":"IF(Données!A292=\"\",\"\",Données!A292)","v":""},"","","","","","","","","","","","","","","","","","","","","","","","","","","","","","","","","","","","",""]
[null,null,null,null,null,null,null,null,{"$f":"IF(Données!A293=\"\",\"\",Données!A293)","v":""},"","","","","","","","","","","","","","","","","","","","","","","","","","","","","","","","","","","","",""]
[null,null,null,null,null,null,null,null,{"$f":"IF(Données!A294=\"\",\"\",Données!A294)","v":""},"","","","","","","","","","","","","","","","","","","","","","","","","","","","","","","","","","","","",""]
[null,null,null,null,null,null,null,null,{"$f":"IF(Données!A295=\"\",\"\",Données!A295)","v":""},"","","","","","","","","","","","","","","","","","","","","","","","","","","","","","","","","","","","",""]
[null,null,null,null,null,null,null,null,{"$f":"IF(Données!A296=\"\",\"\",Données!A296)","v":""},"","","","","","","","","","","","","","","","","","","","","","","","","","","","","","","","","","","","",""]
[null,null,null,null,null,null,null,null,{"$f":"IF(Données!A297=\"\",\"\",Données!A297)","v":""},"","","","","","","","","","","","","","","","","","","","","","","","","","","","","","","","","","","","",""]
[null,null,null,null,null,null,null,null,{"$f":"IF(Données!A298=\"\",\"\",Données!A298)","v":""},"",{"$f":"IF(ISERROR(INDIRECT(\"'\"&$I297&\"'!$j$77\")),\"\",INDIRECT(\"'\"&$I297&\"'!$j$77\"))","v":""},"","","","","","","","","","","","","","","","",{"$f":"IF(ISERROR(IF(COUNTIF(INDIRECT(\"'\"&$I297&\"'!$D$5:$D$80\"),AB$1)>0,1,\"\")),\"\",IF(COUNTIF(INDIRECT(\"'\"&$I297&\"'!$D$5:$D$80\"),AB$1)>0,1,\"\"))","v":""},"","","","","","","","","","","","","","","","","",""]
[null,null,null,null,null,null,null,null,{"$f":"IF(Données!A299=\"\",\"\",Données!A299)","v":""},"","","","","","","","","","","","","","","","","","","","","","","","","","","","","","","","","","","",{"$f":"IF(AS$1=\"\",\"\",IF(ISERROR(IF(COUNTIF(INDIRECT(\"'\"&$I298&\"'!$D$5:$D$80\"),AS$1)>0,1,\"\")),\"\",IF(COUNTIF(INDIRECT(\"'\"&$I298&\"'!$D$5:$D$80\"),AS$1)>0,1,\"\")))","v":""},""]
[null,null,null,null,null,null,null,null,{"$f":"IF(Données!A300=\"\",\"\",Données!A300)","v":""},"","","","","","","","","","","","","","","","","","","","","","","","","","","","","","","","","","","","",""]
[null,null,null,null,null,null,null,null,{"$f":"IF(Données!A301=\"\",\"\",Données!A301)","v":""},"","","","","","","","","","","","","","","","","","","","","","","","","","","","","","","","","","","","",""]
[null,null,null,null,null,null,null,null,{"$f":"IF(Données!A302=\"\",\"\",Données!A302)","v":""},"","","","","","","","","","","","","","","","","","","","","","","","","","","","","","","","","","","","",""]
[null,null,null,null,null,null,null,null,{"$f":"IF(Données!A303=\"\",\"\",Données!A303)","v":""},"","","","","","","","","","","","","","","","","","","","","","","","","","","","","","","","","","","","",""]
[null,null,null,null,null,null,null,null,{"$f":"IF(Données!A304=\"\",\"\",Données!A304)","v":""},"","","","","","","","","","","","","","","","","","","","","","","","","","","","","","","","","","","","",""]
[null,null,null,null,null,null,null,null,{"$f":"IF(Données!A305=\"\",\"\",Données!A305)","v":""},"","","","","","","","","","","","","","","","","",{"$f":"IF(ISERROR(IF(COUNTIF(INDIRECT(\"'\"&$I304&\"'!$D$5:$D$80\"),AA$1)>0,1,\"\")),\"\",IF(COUNTIF(INDIRECT(\"'\"&$I304&\"'!$D$5:$D$80\"),AA$1)>0,1,\"\"))","v":""},"","","","","","","","","","","","","","","","","","",""]
[null,null,null,null,null,null,null,null,{"$f":"IF(Données!A306=\"\",\"\",Données!A306)","v":""},"","",{"$f":"IF(ISERROR(IF(COUNTIF(INDIRECT(\"'\"&$I305&\"'!$D$5:$D$80\"),L$1)>0,1,\"\")),\"\",IF(COUNTIF(INDIRECT(\"'\"&$I305&\"'!$D$5:$D$80\"),L$1)>0,1,\"\"))","v":""},"","","","","","","","","","","","","","","","","","","","","","","","","","","","","","","","","",""]
[null,null,null,null,null,null,null,null,{"$f":"IF(Données!A307=\"\",\"\",Données!A307)","v":""},"","","","","","","","","","","","","","","","","","","","","","","","","","","","","","","","","","","","",""]
[null,null,null,null,null,null,null,null,{"$f":"IF(Données!A308=\"\",\"\",Données!A308)","v":""},"","","","","","","","","","","","","","","","","","","","","","","","","","","","","","","","","","","","",""]
[null,null,null,null,null,null,null,null,{"$f":"IF(Données!A309=\"\",\"\",Données!A309)","v":""},"","","","","","","","","","","","","","","","","","","","","","","","","","","","","","","","","","","","",""]
[null,null,null,null,null,null,null,null,{"$f":"IF(Données!A310=\"\",\"\",Données!A310)","v":""},"","","","","","","","","","","","","","","","","","","","","","","","","","","","","","","","","","","","",""]
[null,null,null,null,null,null,null,null,{"$f":"IF(Données!A311=\"\",\"\",Données!A311)","v":""},"","","","","","","","","","","","","","","","","","","","","","","","","","","","","","","","","","","","",""]
[null,null,null,null,null,null,null,null,{"$f":"IF(Données!A312=\"\",\"\",Données!A312)","v":""},"","","","","","","","","","","","","","","","","","","","","","","","","","","","","","","","","","","","",""]
[null,null,null,null,null,null,null,null,{"$f":"IF(Données!A313=\"\",\"\",Données!A313)","v":""},"","","","","","","","","","","","","","","","","","","","","","","","","","","","","","","","","","","","",""]
[null,null,null,null,null,null,null,null,{"$f":"IF(Données!A314=\"\",\"\",Données!A314)","v":""},"","","","","","","","","","","","","","","","","","","","","","","","","","","","","","","","","","","","",""]
[null,null,null,null,null,null,null,null,{"$f":"IF(Données!A315=\"\",\"\",Données!A315)","v":""},"","","","","","","","","","","","","","","","","","","","","","","","","","","","","","","","","","","","",""]
[null,null,null,null,null,null,null,null,{"$f":"IF(Données!A316=\"\",\"\",Données!A316)","v":""},"","","","","","","","","","","","","","","","","","","","","","","","","","","","","","","","","","","","",""]
[null,null,null,null,null,null,null,null,{"$f":"IF(Données!A317=\"\",\"\",Données!A317)","v":""},"","","","","","","","","","","","","","","","","","","","","","","","","","","","","","","","","","","","",""]
[null,null,null,null,null,null,null,null,{"$f":"IF(Données!A318=\"\",\"\",Données!A318)","v":""},"","","","","","","","","","","","","","","","","","","","","","","","","","","","","","","","","","","","",""]
[null,null,null,null,null,null,null,null,{"$f":"IF(Données!A319=\"\",\"\",Données!A319)","v":""},"","","","","","","","","","","","","","","","","","","","","","","","","","","","","","","","","","","","",""]
[null,null,null,null,null,null,null,null,{"$f":"IF(Données!A320=\"\",\"\",Données!A320)","v":""},"","","","","","","","","","","","","","","","","","","","","","","","","","","","","","","","","","","","",""]
[null,null,null,null,null,null,null,null,{"$f":"IF(Données!A321=\"\",\"\",Données!A321)","v":""},"","","","","","","","","","","","","","","","","",{"$f":"IF(ISERROR(IF(COUNTIF(INDIRECT(\"'\"&$I320&\"'!$D$5:$D$80\"),AA$1)>0,1,\"\")),\"\",IF(COUNTIF(INDIRECT(\"'\"&$I320&\"'!$D$5:$D$80\"),AA$1)>0,1,\"\"))","v":""},"","","","","","","","","","","","","","","","","","",""]
[null,null,null,null,null,null,null,null,{"$f":"IF(Données!A322=\"\",\"\",Données!A322)","v":""},"","",{"$f":"IF(ISERROR(IF(COUNTIF(INDIRECT(\"'\"&$I321&\"'!$D$5:$D$80\"),L$1)>0,1,\"\")),\"\",IF(COUNTIF(INDIRECT(\"'\"&$I321&\"'!$D$5:$D$80\"),L$1)>0,1,\"\"))","v":""},"","","","","","","","","","","","","","","","","","","","","","","","","","","","","","","","","",""]
[null,null,null,null,null,null,null,null,{"$f":"IF(Données!A323=\"\",\"\",Données!A323)","v":""},"","","","","","","","","","","","","","","","","","","","","","","","","","","","","","","","","","","","",""]
[null,null,null,null,null,null,null,null,{"$f":"IF(Données!A324=\"\",\"\",Données!A324)","v":""},{"$f":"IF(SUM(L323:AT323)=0,\"\",SUM(L323:AT323))","v":""},"","","","","","","","","","","","","","","","","","","","","","","","","","","","","","","","","","","",""]
[null,null,null,null,null,null,null,null,{"$f":"IF(Données!A325=\"\",\"\",Données!A325)","v":""},"","","","","","","","","","","","","","","","","","","","","","","","","","","","","","","","","","","","",""]
[null,null,null,null,null,null,null,null,{"$f":"IF(Données!A326=\"\",\"\",Données!A326)","v":""},"","","","","","","","","","","","","","","","","","","","","","","","","","","","","","","","","","","","",""]
[null,null,null,null,null,null,null,null,{"$f":"IF(Données!A327=\"\",\"\",Données!A327)","v":""},"","","","","","","","","","","","","","","","","","","","","","","","","","","","","","","","","","","","",""]
[null,null,null,null,null,null,null,null,{"$f":"IF(Données!A328=\"\",\"\",Données!A328)","v":""},"","","","","","","","","","","","","","","","","","","","","","","","","","","","","",{"$f":"IF(AM$1=\"\",\"\",IF(ISERROR(IF(COUNTIF(INDIRECT(\"'\"&$I327&\"'!$D$5:$D$80\"),AM$1)>0,1,\"\")),\"\",IF(COUNTIF(INDIRECT(\"'\"&$I327&\"'!$D$5:$D$80\"),AM$1)>0,1,\"\")))","v":""},"","","","","","",""]
[null,null,null,null,null,null,null,null,{"$f":"IF(Données!A329=\"\",\"\",Données!A329)","v":""},"","","","","","","","","","","","","","","","","","","","","","","","","","","","","","","","","","","","",""]
[null,null,null,null,null,null,null,null,{"$f":"IF(Données!A330=\"\",\"\",Données!A330)","v":""},"","","","","","","","","","","","","","","","","","","","","","","","","","","","","","","","","","","","",""]
[null,null,null,null,null,null,null,null,{"$f":"IF(Données!A331=\"\",\"\",Données!A331)","v":""},"","","","","","","","","","","","","","","","","","","","","","","","","","","","","","","","","","","","",""]
[null,null,null,null,null,null,null,null,{"$f":"IF(Données!A332=\"\",\"\",Données!A332)","v":""},"","","","","","","","","","","","","","","","","","","","","","","","","","","","","","","","","","","","",""]
[null,null,null,null,null,null,null,null,{"$f":"IF(Données!A333=\"\",\"\",Données!A333)","v":""},"","","","","","","","","","","","","","","","","","","","","","","","","","","","","","","","","","","","",""]
[null,null,null,null,null,null,null,null,{"$f":"IF(Données!A334=\"\",\"\",Données!A334)","v":""},"","","","","","","","","","","","","","","","","","","","","","","","","","","","","","","","","","","","",""]
[null,null,null,null,null,null,null,null,{"$f":"IF(Données!A335=\"\",\"\",Données!A335)","v":""},"","","","","","","","","","","","","","","","","","","","","","","","","","","","","","","","","","","","",""]
[null,null,null,null,null,null,null,null,{"$f":"IF(Données!A336=\"\",\"\",Données!A336)","v":""},"","","","","","","","","","","","","","","","","","","","","","","","","","","","","","","","","","","","",""]
[null,null,null,null,null,null,null,null,{"$f":"IF(Données!A337=\"\",\"\",Données!A337)","v":""},"","","","","","","","","","","","","","","","","",{"$f":"IF(ISERROR(IF(COUNTIF(INDIRECT(\"'\"&$I336&\"'!$D$5:$D$80\"),AA$1)>0,1,\"\")),\"\",IF(COUNTIF(INDIRECT(\"'\"&$I336&\"'!$D$5:$D$80\"),AA$1)>0,1,\"\"))","v":""},"","","","","","","","","","","","","","","","","","",""]
[null,null,null,null,null,null,null,null,{"$f":"IF(Données!A338=\"\",\"\",Données!A338)","v":""},"","",{"$f":"IF(ISERROR(IF(COUNTIF(INDIRECT(\"'\"&$I337&\"'!$D$5:$D$80\"),L$1)>0,1,\"\")),\"\",IF(COUNTIF(INDIRECT(\"'\"&$I337&\"'!$D$5:$D$80\"),L$1)>0,1,\"\"))","v":""},"","","","","","","","","","","","","","","","","","","","","","","","","","","","","","","","","",""]
[null,null,null,null,null,null,null,null,{"$f":"IF(Données!A339=\"\",\"\",Données!A339)","v":""},"","","","","","","","","","","","","","","","","","","","","","","","","","","","","","","","","","","","",""]
[null,null,null,null,null,null,null,null,{"$f":"IF(Données!A340=\"\",\"\",Données!A340)","v":""},"","","","","","","","","","","","","","","","","","","","","","","","","","","","","","","","","","","","",""]
[null,null,null,null,null,null,null,null,{"$f":"IF(Données!A341=\"\",\"\",Données!A341)","v":""},"","","","","","","","","","","","","","","","","","","","","","","","","","","","","","","","","","","","",""]
[null,null,null,null,null,null,null,null,{"$f":"IF(Données!A342=\"\",\"\",Données!A342)","v":""},"","","","","","","","","","","","","","","","","","","","","","","","","","","","","","","","","","","","",""]
[null,null,null,null,null,null,null,null,{"$f":"IF(Données!A343=\"\",\"\",Données!A343)","v":""},"","","","","","","","","","","","","","","","","","","","","","","","","","","","","","","","","","","","",""]
[null,null,null,null,null,null,null,null,{"$f":"IF(Données!A344=\"\",\"\",Données!A344)","v":""},"","","","","","","","","","","","","","","","","","","","","","","","","","","","","","","","","","","","",""]
[null,null,null,null,null,null,null,null,{"$f":"IF(Données!A345=\"\",\"\",Données!A345)","v":""},"","","","","","","","","","","","","","","","","","","","","","","","","","","","","","","","","","","","",""]
[null,null,null,null,null,null,null,null,{"$f":"IF(Données!A346=\"\",\"\",Données!A346)","v":""},"","","","","","","","","","","","","","","","","","","","","","","","","","","","","","","","","","","","",""]
[null,null,null,null,null,null,null,null,{"$f":"IF(Données!A347=\"\",\"\",Données!A347)","v":""},"","","","","","","","","","","","","","","","","","","","","","","","","","","","","","","","","","","","",""]
[null,null,null,null,null,null,null,null,{"$f":"IF(Données!A348=\"\",\"\",Données!A348)","v":""},"","","","","","","","","","","","","","","","","","","","","","","","","","","","","","","","","","","","",""]
[null,null,null,null,null,null,null,null,{"$f":"IF(Données!A349=\"\",\"\",Données!A349)","v":""},"","","","","","","","","","","","","","","","","","","","","","","","","","","","","","","","","","","","",""]
[null,null,null,null,null,null,null,null,{"$f":"IF(Données!A350=\"\",\"\",Données!A350)","v":""},"","","","","","","","","","","","","","","","","","","","","","","","","","","","","","","","","","","","",""]
[null,null,null,null,null,null,null,null,{"$f":"IF(Données!A351=\"\",\"\",Données!A351)","v":""},"","","","","","","","","","","","","","","","","","","","","","","","","","","","","","","","","","","","",""]
[null,null,null,null,null,null,null,null,{"$f":"IF(Données!A352=\"\",\"\",Données!A352)","v":""},"","","","","","","","","","","","","","","","","","","","","","","","","","","","","","","","","","","","",""]
[null,null,null,null,null,null,null,null,{"$f":"IF(Données!A353=\"\",\"\",Données!A353)","v":""},"","","","","","","","","","","","","","","","","",{"$f":"IF(ISERROR(IF(COUNTIF(INDIRECT(\"'\"&$I352&\"'!$D$5:$D$80\"),AA$1)>0,1,\"\")),\"\",IF(COUNTIF(INDIRECT(\"'\"&$I352&\"'!$D$5:$D$80\"),AA$1)>0,1,\"\"))","v":""},"","","","","","","","","","","","","","","","","","",""]
[null,null,null,null,null,null,null,null,{"$f":"IF(Données!A354=\"\",\"\",Données!A354)","v":""},"","",{"$f":"IF(ISERROR(IF(COUNTIF(INDIRECT(\"'\"&$I353&\"'!$D$5:$D$80\"),L$1)>0,1,\"\")),\"\",IF(COUNTIF(INDIRECT(\"'\"&$I353&\"'!$D$5:$D$80\"),L$1)>0,1,\"\"))","v":""},"","","","","","","","","","","","","","","","","","","","","","","","","","","","","","","","","",""]
[null,null,null,null,null,null,null,null,{"$f":"IF(Données!A355=\"\",\"\",Données!A355)","v":""},"","","","","","","","","","","","","","","","","","","","","","","","","","","","","","","","","","","","",""]
[null,null,null,null,null,null,null,null,{"$f":"IF(Données!A356=\"\",\"\",Données!A356)","v":""},"","","","","","","","","","","","","","","","","","","","","","","","","","","","","","","","",{"$f":"IF(AP$1=\"\",\"\",IF(ISERROR(IF(COUNTIF(INDIRECT(\"'\"&$I355&\"'!$D$5:$D$80\"),AP$1)>0,1,\"\")),\"\",IF(COUNTIF(INDIRECT(\"'\"&$I355&\"'!$D$5:$D$80\"),AP$1)>0,1,\"\")))","v":""},"","","",""]
[null,null,null,null,null,null,null,null,{"$f":"IF(Données!A357=\"\",\"\",Données!A357)","v":""},"","","","","","","","","","","","","","","","","","","","","","","","","","","","","","","","","","","","",""]
[null,null,null,null,null,null,null,null,{"$f":"IF(Données!A358=\"\",\"\",Données!A358)","v":""},"","","","","","","","","","","","","","","","","","","","","","","","","","","","","","","","","","","","",""]
[null,null,null,null,null,null,null,null,{"$f":"IF(Données!A359=\"\",\"\",Données!A359)","v":""},"","","","","","","","","","","","","","","","","","","","","","","","","","","","","","","","","","","","",""]
[null,null,null,null,null,null,null,null,{"$f":"IF(Données!A360=\"\",\"\",Données!A360)","v":""},"","","","","","","","","","","","","","","","","","","","","","","","","","","","","","","","","","","","",""]
[null,null,null,null,null,null,null,null,{"$f":"IF(Données!A361=\"\",\"\",Données!A361)","v":""},"","","","","","","","","","","","","","","","","","","","","","","","","","","","","","","","","","","","",""]
[null,null,null,null,null,null,null,null,{"$f":"IF(Données!A362=\"\",\"\",Données!A362)","v":""},"",{"$f":"IF(ISERROR(INDIRECT(\"'\"&$I361&\"'!$j$77\")),\"\",INDIRECT(\"'\"&$I361&\"'!$j$77\"))","v":""},"","","","","","","","","","","","","","","","","","","","","","","","","","","","","","","","","","",""]
[null,null,null,null,null,null,null,null,{"$f":"IF(Données!A363=\"\",\"\",Données!A363)","v":""},"","","","","","","","","","","","","","","","","","","","","","","","","","","","","","","","","","","","",""]
[null,null,null,null,null,null,null,null,{"$f":"IF(Données!A364=\"\",\"\",Données!A364)","v":""},"","","","","","","","","","","","","","","","","","","","","","","","","","","","","","","","","","","","",""]
[null,null,null,null,null,null,null,null,{"$f":"IF(Données!A365=\"\",\"\",Données!A365)","v":""},"","","","","","","","","","","","","","","","","","","","","","","","","","","","","","","","","","","","",""]
[null,null,null,null,null,null,null,null,{"$f":"IF(Données!A366=\"\",\"\",Données!A366)","v":""},"","","","","","","","","","","","","","","","","","","","","","","","","","","","","","","","","","","","",""]
[null,null,null,null,null,null,null,null,{"$f":"IF(Données!A367=\"\",\"\",Données!A367)","v":""},"","","","","","","","","","","","","","","","","","","","","","","","","","","","","","","","","","","","",""]
[null,null,null,null,null,null,null,null,{"$f":"IF(Données!A368=\"\",\"\",Données!A368)","v":""},"","","","","","","","","","","","","","","","","","","","","","","","","","","","","","","","","","","","",""]
[null,null,null,null,null,null,null,null,{"$f":"IF(Données!A369=\"\",\"\",Données!A369)","v":""},"","","","","","","","","","","","","","","","","",{"$f":"IF(ISERROR(IF(COUNTIF(INDIRECT(\"'\"&$I368&\"'!$D$5:$D$80\"),AA$1)>0,1,\"\")),\"\",IF(COUNTIF(INDIRECT(\"'\"&$I368&\"'!$D$5:$D$80\"),AA$1)>0,1,\"\"))","v":""},"","","","","","","","","","","","","","","","","","",""]
[null,null,null,null,null,null,null,null,{"$f":"IF(Données!A370=\"\",\"\",Données!A370)","v":""},"","",{"$f":"IF(ISERROR(IF(COUNTIF(INDIRECT(\"'\"&$I369&\"'!$D$5:$D$80\"),L$1)>0,1,\"\")),\"\",IF(COUNTIF(INDIRECT(\"'\"&$I369&\"'!$D$5:$D$80\"),L$1)>0,1,\"\"))","v":""},"","","","","","","","","","","","","","","","","","","","","","","","","","","","","","","","","",""]
[null,null,null,null,null,null,null,null,{"$f":"IF(Données!A371=\"\",\"\",Données!A371)","v":""},"","","","","","","","","","","","","","","","","","","","","","","","","","","","","","","","","","","","",""]
[null,null,null,null,null,null,null,null,{"$f":"IF(Données!A372=\"\",\"\",Données!A372)","v":""},"","","","","","","","","","","","","","","","","","","","","","","","","","","","","","","","","","","","",""]
[null,null,null,null,null,null,null,null,{"$f":"IF(Données!A373=\"\",\"\",Données!A373)","v":""},"","","","","","","","","","","","","","","","","","","","","","","","","","","","","","","","","","","","",""]
[null,null,null,null,null,null,null,null,{"$f":"IF(Données!A374=\"\",\"\",Données!A374)","v":""},"","","","","","","","","","","","","","","","","","","","","","","","","","","","","","","","","","","","",""]
[null,null,null,null,null,null,null,null,{"$f":"IF(Données!A375=\"\",\"\",Données!A375)","v":""},"","","","","","","","","","","","","","","","","","","","","","","","","","","","","","","","","","","","",""]
[null,null,null,null,null,null,null,null,{"$f":"IF(Données!A376=\"\",\"\",Données!A376)","v":""},"","","","","","","","","","","","","","","","","","","","","","","","","","","","","","","","","","","","",""]
[null,null,null,null,null,null,null,null,{"$f":"IF(Données!A377=\"\",\"\",Données!A377)","v":""},"","","","","","","","","","","","","","","","","","","","","","","","","","","","","","","","","","","","",""]
[null,null,null,null,null,null,null,null,{"$f":"IF(Données!A378=\"\",\"\",Données!A378)","v":""},"","","","","","","","","","","","","","","","","","","","","","","","","","","","","","","","","","","","",""]
[null,null,null,null,null,null,null,null,{"$f":"IF(Données!A379=\"\",\"\",Données!A379)","v":""},"","","","","","","","","","","","","","","","","","","","","","","","","","","","","","","","","","","","",""]
[null,null,null,null,null,null,null,null,{"$f":"IF(Données!A380=\"\",\"\",Données!A380)","v":""},"","","","","","","","","","","","","","","","","","","","","","","","","","","","","","","","","","","","",""]
[null,null,null,null,null,null,null,null,{"$f":"IF(Données!A381=\"\",\"\",Données!A381)","v":""},"","","","","","","","","","","","","","","","","","","","","","","","","","","","","","","","","","","","",""]
[null,null,null,null,null,null,null,null,{"$f":"IF(Données!A382=\"\",\"\",Données!A382)","v":""},"","","","","","","","","","","","","","","","","","","","","","","","","","","","","","","","","","","","",""]
[null,null,null,null,null,null,null,null,{"$f":"IF(Données!A383=\"\",\"\",Données!A383)","v":""},"","","","","","","","","","","","","","","","","","","","","","","","","","","","","","","","","","","","",""]
[null,null,null,null,null,null,null,null,{"$f":"IF(Données!A384=\"\",\"\",Données!A384)","v":""},"","","","","","","","","","","","","","","","","","","","","","","","","","","","","","","","","","","",{"$f":"IF(AS$1=\"\",\"\",IF(ISERROR(IF(COUNTIF(INDIRECT(\"'\"&$I383&\"'!$D$5:$D$80\"),AS$1)>0,1,\"\")),\"\",IF(COUNTIF(INDIRECT(\"'\"&$I383&\"'!$D$5:$D$80\"),AS$1)>0,1,\"\")))","v":""},""]
[null,null,null,null,null,null,null,null,{"$f":"IF(Données!A385=\"\",\"\",Données!A385)","v":""},"","","","","","","","","","","","","","","","","",{"$f":"IF(ISERROR(IF(COUNTIF(INDIRECT(\"'\"&$I384&\"'!$D$5:$D$80\"),AA$1)>0,1,\"\")),\"\",IF(COUNTIF(INDIRECT(\"'\"&$I384&\"'!$D$5:$D$80\"),AA$1)>0,1,\"\"))","v":""},"","","","","","","","","","","","","","","","","","",""]
[null,null,null,null,null,null,null,null,{"$f":"IF(Données!A386=\"\",\"\",Données!A386)","v":""},"","",{"$f":"IF(ISERROR(IF(COUNTIF(INDIRECT(\"'\"&$I385&\"'!$D$5:$D$80\"),L$1)>0,1,\"\")),\"\",IF(COUNTIF(INDIRECT(\"'\"&$I385&\"'!$D$5:$D$80\"),L$1)>0,1,\"\"))","v":""},"","","","","","","","","","","","","","","","","","","","","","","","","","","","","","","","","",""]
[null,null,null,null,null,null,null,null,{"$f":"IF(Données!A387=\"\",\"\",Données!A387)","v":""},"","","","","","","","","","","","","","","","","","","","","","","","","","","","","","","","","","","","",""]
[null,null,null,null,null,null,null,null,{"$f":"IF(Données!A388=\"\",\"\",Données!A388)","v":""},{"$f":"IF(SUM(L387:AT387)=0,\"\",SUM(L387:AT387))","v":""},"","","","","","","","","","","","","","","","","","","","","","","","","","","","","","","","","","","",""]
[null,null,null,null,null,null,null,null,{"$f":"IF(Données!A389=\"\",\"\",Données!A389)","v":""},"","","","","","","","","","","","","","","","","","","","","","","","","","","","","","","","","","","","",""]
[null,null,null,null,null,null,null,null,{"$f":"IF(Données!A390=\"\",\"\",Données!A390)","v":""},"","","","","","","","","","","","","","","","","","","","","","","","","","","","","","","","","","","","",""]
[null,null,null,null,null,null,null,null,{"$f":"IF(Données!A391=\"\",\"\",Données!A391)","v":""},"","","","","","","","","","","","","","","","","","","","","","","","","","","","","","","","","","","","",""]
[null,null,null,null,null,null,null,null,{"$f":"IF(Données!A392=\"\",\"\",Données!A392)","v":""},"","","","","","","","","","","","","","","","","","","","","","","","","","","","","","","","","","","","",""]
[null,null,null,null,null,null,null,null,{"$f":"IF(Données!A393=\"\",\"\",Données!A393)","v":""},"","","","","","","","","","","","","","","","","","","","","","","","","","","","","","","","","","","","",""]
[null,null,null,null,null,null,null,null,{"$f":"IF(Données!A394=\"\",\"\",Données!A394)","v":""},"","","","","","","","","","","","","","","","","","","","","","","","","","","","","","","","","","","","",""]
[null,null,null,null,null,null,null,null,{"$f":"IF(Données!A395=\"\",\"\",Données!A395)","v":""},"","","","","","","","","","","","","","","","","","","","","","","","","","","","","","","","","","","","",""]
[null,null,null,null,null,null,null,null,{"$f":"IF(Données!A396=\"\",\"\",Données!A396)","v":""},"","","","","","","","","","","","","","","","","","","","","","","","","","","","","","","","","","","","",""]
[null,null,null,null,null,null,null,null,{"$f":"IF(Données!A397=\"\",\"\",Données!A397)","v":""},"","","","","","","","","","","","","","","","","","","","","","","","","","","","","","","","","","","","",""]
[null,null,null,null,null,null,null,null,{"$f":"IF(Données!A398=\"\",\"\",Données!A398)","v":""},"","","","","","","","","","","","","","","","","","","","","","","","","","","","","","","","","","","","",""]
[null,null,null,null,null,null,null,null,{"$f":"IF(Données!A399=\"\",\"\",Données!A399)","v":""},"","","","","","","","","","","","","","","","","","","","","","","","","","","","","","","","","","","","",""]
[null,null,null,null,null,null,null,null,{"$f":"IF(Données!A400=\"\",\"\",Données!A400)","v":""},"","","","","","","","","","","","","","","","","","","","","","","","","","","","","","","","","","","","",""]
[null,null,null,null,null,null,null,null,{"$f":"IF(Données!A401=\"\",\"\",Données!A401)","v":""},"","","","","","","","","","","","","","","","","",{"$f":"IF(ISERROR(IF(COUNTIF(INDIRECT(\"'\"&$I400&\"'!$D$5:$D$80\"),AA$1)>0,1,\"\")),\"\",IF(COUNTIF(INDIRECT(\"'\"&$I400&\"'!$D$5:$D$80\"),AA$1)>0,1,\"\"))","v":""},"","","","","","","","","","","","","","","","","","",""]
[null,null,null,null,null,null,null,null,{"$f":"IF(Données!A402=\"\",\"\",Données!A402)","v":""},"","",{"$f":"IF(ISERROR(IF(COUNTIF(INDIRECT(\"'\"&$I401&\"'!$D$5:$D$80\"),L$1)>0,1,\"\")),\"\",IF(COUNTIF(INDIRECT(\"'\"&$I401&\"'!$D$5:$D$80\"),L$1)>0,1,\"\"))","v":""},"","","","","","","","","","","","","","","","","","","","","","","","","","","","","","","","","",""]
[null,null,null,null,null,null,null,null,{"$f":"IF(Données!A403=\"\",\"\",Données!A403)","v":""},"","","","","","","","","","","","","","","","","","","","","","","","","","","","","","","","","","","","",""]
[null,null,null,null,null,null,null,null,{"$f":"IF(Données!A404=\"\",\"\",Données!A404)","v":""},"","","","","","","","","","","","","","","","","","","","","","","","","","","","","","","","","","","","",""]
[null,null,null,null,null,null,null,null,{"$f":"IF(Données!A405=\"\",\"\",Données!A405)","v":""},"","","","","","","","","","","","","","","","","","","","","","","","","","","","","","","","","","","","",""]
[null,null,null,null,null,null,null,null,{"$f":"IF(Données!A406=\"\",\"\",Données!A406)","v":""},"","","","","","","","","","","","","","","","","","","","","","","","","","","","","","","","","","","","",""]
[null,null,null,null,null,null,null,null,{"$f":"IF(Données!A407=\"\",\"\",Données!A407)","v":""},"","","","","","","","","","","","","","","","","","","","","","","","","","","","","","","","","","","","",""]
[null,null,null,null,null,null,null,null,{"$f":"IF(Données!A408=\"\",\"\",Données!A408)","v":""},"","","","","","","","","","","","","","","","","","","","","","","","","","","","","","","","","","","","",""]
[null,null,null,null,null,null,null,null,{"$f":"IF(Données!A409=\"\",\"\",Données!A409)","v":""},"","","","","","","","","","","","","","","","","","","","","","","","","","","","","","","","","","","","",""]
[null,null,null,null,null,null,null,null,{"$f":"IF(Données!A410=\"\",\"\",Données!A410)","v":""},"","","","","","","","","","","","","","","","","","","","","","","","","","","","","","","","","","","","",""]
[null,null,null,null,null,null,null,null,{"$f":"IF(Données!A411=\"\",\"\",Données!A411)","v":""},"","","","","","","","","","","","","","","","","","","","","","","","","","","","","","","","","","","","",""]
[null,null,null,null,null,null,null,null,{"$f":"IF(Données!A412=\"\",\"\",Données!A412)","v":""},"","","","","","","","","","","","","","","","","","","","","","","","","","","","","","","","","","","","",""]
[null,null,null,null,null,null,null,null,{"$f":"IF(Données!A413=\"\",\"\",Données!A413)","v":""},"","","","","","","","","","","","","","","","","","","","","","","","","","","","","",{"$f":"IF(AM$1=\"\",\"\",IF(ISERROR(IF(COUNTIF(INDIRECT(\"'\"&$I412&\"'!$D$5:$D$80\"),AM$1)>0,1,\"\")),\"\",IF(COUNTIF(INDIRECT(\"'\"&$I412&\"'!$D$5:$D$80\"),AM$1)>0,1,\"\")))","v":""},"","","","","","",""]
[null,null,null,null,null,null,null,null,{"$f":"IF(Données!A414=\"\",\"\",Données!A414)","v":""},"","","","","","","","","","","","","","","","","","","","","","","","","","","","","","","","","","","","",""]
[null,null,null,null,null,null,null,null,{"$f":"IF(Données!A415=\"\",\"\",Données!A415)","v":""},"","","","","","","","","","","","","","","","","","","","","","","","","","","","","","","","","","","","",""]
[null,null,null,null,null,null,null,null,{"$f":"IF(Données!A416=\"\",\"\",Données!A416)","v":""},"","","",{"$f":"IF(ISERROR(IF(COUNTIF(INDIRECT(\"'\"&$I415&\"'!$D$5:$D$80\"),M$1)>0,1,\"\")),\"\",IF(COUNTIF(INDIRECT(\"'\"&$I415&\"'!$D$5:$D$80\"),M$1)>0,1,\"\"))","v":""},"","","","","","","","","","","","","","","","","","","","","","","","","","","","","","","","",""]
[null,null,null,null,null,null,null,null,{"$f":"IF(Données!A417=\"\",\"\",Données!A417)","v":""},"","","","","","","","","","","","","","","","","","","","","","","","","","","","","","","","","","","","",""]
[null,null,null,null,null,null,null,null,{"$f":"IF(Données!A418=\"\",\"\",Données!A418)","v":""},"","","","","","","","","","","","","","","","","","","","","","","","","","","","","","","","","","","","",""]
[null,null,null,null,null,null,null,null,{"$f":"IF(Données!A419=\"\",\"\",Données!A419)","v":""},"","","","","","","","","","","","","","","","","","","","","","","","","","","","","","","","","","","","",""]
[null,null,null,null,null,null,null,null,{"$f":"IF(Données!A420=\"\",\"\",Données!A420)","v":""},"","","","","","","","","","","","","","","","","","","","","","","","","","","","","","","","","","","","",""]
[null,null,null,null,null,null,null,null,{"$f":"IF(Données!A421=\"\",\"\",Données!A421)","v":""},"","","","","","","","","","","","","","","","","","","","","","","","","","","","","","","","","","","","",""]
[null,null,null,null,null,null,null,null,{"$f":"IF(Données!A422=\"\",\"\",Données!A422)","v":""},"","","","","","","","","","","","","","","","","","","","","","","","","","","","","","","","","","","","",""]
[null,null,null,null,null,null,null,null,{"$f":"IF(Données!A423=\"\",\"\",Données!A423)","v":""},"","","","","","","","","","","","","","","","","","","",{"$f":"IF(ISERROR(IF(COUNTIF(INDIRECT(\"'\"&$I422&\"'!$D$5:$D$80\"),AC$1)>0,1,\"\")),\"\",IF(COUNTIF(INDIRECT(\"'\"&$I422&\"'!$D$5:$D$80\"),AC$1)>0,1,\"\"))","v":""},"","","","","","","","","","","","","","","","",""]
[null,null,null,null,null,null,null,null,{"$f":"IF(Données!A424=\"\",\"\",Données!A424)","v":""},"","","","","","","","","","","","","","","","","","",{"$f":"IF(ISERROR(IF(COUNTIF(INDIRECT(\"'\"&$I423&\"'!$D$5:$D$80\"),AB$1)>0,1,\"\")),\"\",IF(COUNTIF(INDIRECT(\"'\"&$I423&\"'!$D$5:$D$80\"),AB$1)>0,1,\"\"))","v":""},"","","","","","","","","","","","","","","","","",""]
[null,null,null,null,null,null,null,null,{"$f":"IF(Données!A425=\"\",\"\",Données!A425)","v":""},"","","","","","","","","",{"$f":"IF(ISERROR(IF(COUNTIF(INDIRECT(\"'\"&$I424&\"'!$D$5:$D$80\"),S$1)>0,1,\"\")),\"\",IF(COUNTIF(INDIRECT(\"'\"&$I424&\"'!$D$5:$D$80\"),S$1)>0,1,\"\"))","v":""},"","","","","","","","","","","","","","","","","","","","","","","","","","",""]
[null,null,null,null,null,null,null,null,{"$f":"IF(Données!A426=\"\",\"\",Données!A426)","v":""},"",{"$f":"IF(ISERROR(INDIRECT(\"'\"&$I425&\"'!$j$77\")),\"\",INDIRECT(\"'\"&$I425&\"'!$j$77\"))","v":""},{"$f":"IF(ISERROR(IF(COUNTIF(INDIRECT(\"'\"&$I425&\"'!$D$5:$D$80\"),L$1)>0,1,\"\")),\"\",IF(COUNTIF(INDIRECT(\"'\"&$I425&\"'!$D$5:$D$80\"),L$1)>0,1,\"\"))","v":""},"","","","","","","","","","","","","","","","","","","","","","","","","","","","","","","","","",""]
[null,null,null,null,null,null,null,null,{"$f":"IF(Données!A427=\"\",\"\",Données!A427)","v":""},"","","","","","","","","","","","","","","","","","","","","","","","","","","","","","","","","","","","",""]
[null,null,null,null,null,null,null,null,{"$f":"IF(Données!A428=\"\",\"\",Données!A428)","v":""},"","","","","","","","","","","","","","","","","","","","","","","","","","","","","","","","","","","","",""]
[null,null,null,null,null,null,null,null,{"$f":"IF(Données!A429=\"\",\"\",Données!A429)","v":""},"","","","","","","","","","","","","","","","","","","","","","","","","","","","","","","","","","","","",""]
[null,null,null,null,null,null,null,null,{"$f":"IF(Données!A430=\"\",\"\",Données!A430)","v":""},"","","","","","","","","","","","","","","","","","","","","","","","","","","","","","","","","","","","",""]
[null,null,null,null,null,null,null,null,{"$f":"IF(Données!A431=\"\",\"\",Données!A431)","v":""},"","","","","","","","","","","","","","","","","","","","","","","","","","","","","","","","","","","","",""]
[null,null,null,null,null,null,null,null,{"$f":"IF(Données!A432=\"\",\"\",Données!A432)","v":""},"","","","","","","","","","","","","","","","","","","","","","","","","","","","","","","","","","","","",""]
[null,null,null,null,null,null,null,null,{"$f":"IF(Données!A433=\"\",\"\",Données!A433)","v":""},"","","","","","","","","","","","","","","","","","","","","","","","","","","","","","","","","","","","",""]
[null,null,null,null,null,null,null,null,{"$f":"IF(Données!A434=\"\",\"\",Données!A434)","v":""},"","","","","","","","","","","","","","","","","","",{"$f":"IF(ISERROR(IF(COUNTIF(INDIRECT(\"'\"&$I433&\"'!$D$5:$D$80\"),AB$1)>0,1,\"\")),\"\",IF(COUNTIF(INDIRECT(\"'\"&$I433&\"'!$D$5:$D$80\"),AB$1)>0,1,\"\"))","v":""},"","","","","","","","","","","","","","","","","",""]
[null,null,null,null,null,null,null,null,{"$f":"IF(Données!A435=\"\",\"\",Données!A435)","v":""},"","","","","","","","","","","","","","","","","","","","","","","","","","","","","","","","","","","","",""]
[null,null,null,null,null,null,null,null,{"$f":"IF(Données!A436=\"\",\"\",Données!A436)","v":""},"","","","","","","","","","","","","","","","","","","","","","","","","","","","","","","","","","","","",""]
[null,null,null,null,null,null,null,null,{"$f":"IF(Données!A437=\"\",\"\",Données!A437)","v":""},"","","","","","","","","","","","","","","","","","","","","","","","","","","","","","","","","","","","",""]
[null,null,null,null,null,null,null,null,{"$f":"IF(Données!A438=\"\",\"\",Données!A438)","v":""},"","","","","","","","","","","","","","","","","","","","","","","","","","","","","","","","","","","","",""]
[null,null,null,null,null,null,null,null,{"$f":"IF(Données!A439=\"\",\"\",Données!A439)","v":""},"","","","","","","","","","","","","","","","","","","","","","","","","","","","","","","","","","","","",""]
[null,null,null,null,null,null,null,null,{"$f":"IF(Données!A440=\"\",\"\",Données!A440)","v":""},"","","","","","","","","","","","","","","","","","","","","","","","","","","","","","","","","","","","",""]
[null,null,null,null,null,null,null,null,{"$f":"IF(Données!A441=\"\",\"\",Données!A441)","v":""},"","","","","","","","","","","","","","","","","",{"$f":"IF(ISERROR(IF(COUNTIF(INDIRECT(\"'\"&$I440&\"'!$D$5:$D$80\"),AA$1)>0,1,\"\")),\"\",IF(COUNTIF(INDIRECT(\"'\"&$I440&\"'!$D$5:$D$80\"),AA$1)>0,1,\"\"))","v":""},"","","","","","","","","","","","","","",{"$f":"IF(AP$1=\"\",\"\",IF(ISERROR(IF(COUNTIF(INDIRECT(\"'\"&$I440&\"'!$D$5:$D$80\"),AP$1)>0,1,\"\")),\"\",IF(COUNTIF(INDIRECT(\"'\"&$I440&\"'!$D$5:$D$80\"),AP$1)>0,1,\"\")))","v":""},"","","",""]
[null,null,null,null,null,null,null,null,{"$f":"IF(Données!A442=\"\",\"\",Données!A442)","v":""},"","",{"$f":"IF(ISERROR(IF(COUNTIF(INDIRECT(\"'\"&$I441&\"'!$D$5:$D$80\"),L$1)>0,1,\"\")),\"\",IF(COUNTIF(INDIRECT(\"'\"&$I441&\"'!$D$5:$D$80\"),L$1)>0,1,\"\"))","v":""},"","","","","","","","","","","","","","","","","","","","","","","","","","","","","","","","","",""]
[null,null,null,null,null,null,null,null,{"$f":"IF(Données!A443=\"\",\"\",Données!A443)","v":""},"","","","","","","","","","","","","","","","","","","","","","","","","","","","","","","","","","","","",""]
[null,null,null,null,null,null,null,null,{"$f":"IF(Données!A444=\"\",\"\",Données!A444)","v":""},"","","","","","","","","","","","","","","","","","","","","","","","","","","","","","","","","","","","",""]
[null,null,null,null,null,null,null,null,{"$f":"IF(Données!A445=\"\",\"\",Données!A445)","v":""},"","","","","","","","","","","","","","","","","","","","","","","","","","","","","","","","","","","","",""]
[null,null,null,null,null,null,null,null,{"$f":"IF(Données!A446=\"\",\"\",Données!A446)","v":""},"","","","","","","","","","","","","","","","","","","","","","","","","","","","","","","","","","","","",""]
[null,null,null,null,null,null,null,null,{"$f":"IF(Données!A447=\"\",\"\",Données!A447)","v":""},"","","","","","","","","","","","","","","","","","","","","","","","","","","","","","","","","","","","",""]
[null,null,null,null,null,null,null,null,{"$f":"IF(Données!A448=\"\",\"\",Données!A448)","v":""},"","","","","","","","","","","","","","","","","","","","","","","","","","","","","","","","","","","","",""]
[null,null,null,null,null,null,null,null,{"$f":"IF(Données!A449=\"\",\"\",Données!A449)","v":""},"","","","","","","","","","","","","","","","","","","","","","","","","","","","","","","","","","","","",""]
[null,null,null,null,null,null,null,null,{"$f":"IF(Données!A450=\"\",\"\",Données!A450)","v":""},"","","","","","","","","","","","","","","","","","","","","","","","","","","","","","","","","","","","",""]
[null,null,null,null,null,null,null,null,{"$f":"IF(Données!A451=\"\",\"\",Données!A451)","v":""},"","","","","","","","","","","","","","","","","","","","","","","","","","","","","","","","","","","","",""]
[null,null,null,null,null,null,null,null,{"$f":"IF(Données!A452=\"\",\"\",Données!A452)","v":""},{"$f":"IF(SUM(L451:AT451)=0,\"\",SUM(L451:AT451))","v":""},"","","","","","","","","","","","","","","","","","","","","","","","","","","","","","","","","","","",""]
[null,null,null,null,null,null,null,null,{"$f":"IF(Données!A453=\"\",\"\",Données!A453)","v":""},"","","","","","","","","","","","","","","","","","","","","","","","","","","","","","","","","","","","",""]
[null,null,null,null,null,null,null,null,{"$f":"IF(Données!A454=\"\",\"\",Données!A454)","v":""},"","","","","","","","","","","","","","","","","","","","","","","","","","","","","","","","","","","","",""]
[null,null,null,null,null,null,null,null,{"$f":"IF(Données!A455=\"\",\"\",Données!A455)","v":""},"","","","","","","","","","","","","","","","","","","","","","","","","","","","","","","","","","","","",""]
[null,null,null,null,null,null,null,null,{"$f":"IF(Données!A456=\"\",\"\",Données!A456)","v":""},"","","","","","","","","","","","","","","","","","","","","","","","","","","","","","","","","","","","",""]
[null,null,null,null,null,null,null,null,{"$f":"IF(Données!A457=\"\",\"\",Données!A457)","v":""},"","","","","","","","","","","","","","","","","",{"$f":"IF(ISERROR(IF(COUNTIF(INDIRECT(\"'\"&$I456&\"'!$D$5:$D$80\"),AA$1)>0,1,\"\")),\"\",IF(COUNTIF(INDIRECT(\"'\"&$I456&\"'!$D$5:$D$80\"),AA$1)>0,1,\"\"))","v":""},"","","","","","","","","","","","","","","","","","",""]
[null,null,null,null,null,null,null,null,{"$f":"IF(Données!A458=\"\",\"\",Données!A458)","v":""},"","",{"$f":"IF(ISERROR(IF(COUNTIF(INDIRECT(\"'\"&$I457&\"'!$D$5:$D$80\"),L$1)>0,1,\"\")),\"\",IF(COUNTIF(INDIRECT(\"'\"&$I457&\"'!$D$5:$D$80\"),L$1)>0,1,\"\"))","v":""},"","","","","","","","","","","","","","","","","","","","","","","","","","","","","","","","","",""]
[null,null,null,null,null,null,null,null,{"$f":"IF(Données!A459=\"\",\"\",Données!A459)","v":""},"","","","","","","","","","","","","","","","","","","","","","","","","","","","","","","","","","","","",""]
[null,null,null,null,null,null,null,null,{"$f":"IF(Données!A460=\"\",\"\",Données!A460)","v":""},"","","","","","","","","","","","","","","","","","","","","","","","","","","","","","","","","","","","",""]
[null,null,null,null,null,null,null,null,{"$f":"IF(Données!A461=\"\",\"\",Données!A461)","v":""},"","","","","","","","","","","","","","","","","","","","","","","","","","","","","","","","","","","","",""]
[null,null,null,null,null,null,null,null,{"$f":"IF(Données!A462=\"\",\"\",Données!A462)","v":""},"","","","","","","","","","","","","","","","","","","","","","","","","","","","","","","","","","","","",""]
[null,null,null,null,null,null,null,null,{"$f":"IF(Données!A463=\"\",\"\",Données!A463)","v":""},"","","","","","","","","","","","","","","","","","","","","","","","","","","","","","","","","","","","",""]
[null,null,null,null,null,null,null,null,{"$f":"IF(Données!A464=\"\",\"\",Données!A464)","v":""},"","","","","","","","","","","","","","","","","","","","","","","","","","","","","","","","","","","","",""]
[null,null,null,null,null,null,null,null,{"$f":"IF(Données!A465=\"\",\"\",Données!A465)","v":""},"","","","","","","","","","","","","","","","","","","","","","","","","","","","","","","","","","","","",""]
[null,null,null,null,null,null,null,null,{"$f":"IF(Données!A466=\"\",\"\",Données!A466)","v":""},"","","","","","","","","","","","","","","","","","","","","","","","","","","","","","","","","","","","",""]
[null,null,null,null,null,null,null,null,{"$f":"IF(Données!A467=\"\",\"\",Données!A467)","v":""},"","","","","","","","","","","","","","","","","","","","","","","","","","","","","","","","","","","","",""]
[null,null,null,null,null,null,null,null,{"$f":"IF(Données!A468=\"\",\"\",Données!A468)","v":""},"","","","","","","","","","","","","","","","","","","","","","","","","","","","","","","","","","","","",""]
[null,null,null,null,null,null,null,null,{"$f":"IF(Données!A469=\"\",\"\",Données!A469)","v":""},"","","","","","","","","","","","","","","","","","","","","","","","","","","","","","","","","","","",{"$f":"IF(AS$1=\"\",\"\",IF(ISERROR(IF(COUNTIF(INDIRECT(\"'\"&$I468&\"'!$D$5:$D$80\"),AS$1)>0,1,\"\")),\"\",IF(COUNTIF(INDIRECT(\"'\"&$I468&\"'!$D$5:$D$80\"),AS$1)>0,1,\"\")))","v":""},""]
[null,null,null,null,null,null,null,null,{"$f":"IF(Données!A470=\"\",\"\",Données!A470)","v":""},"","","","","","","","","","","","","","","","","","","","","","","","","","","","","","","","","","","","",""]
[null,null,null,null,null,null,null,null,{"$f":"IF(Données!A471=\"\",\"\",Données!A471)","v":""},"","","","","","","","","","","","","","","","","","","","","","","","","","","","","","","","","","","","",""]
[null,null,null,null,null,null,null,null,{"$f":"IF(Données!A472=\"\",\"\",Données!A472)","v":""},"","","","","","","","","","","","","","","","","","","","","","","","","","","","","","","","","","","","",""]
[null,null,null,null,null,null,null,null,{"$f":"IF(Données!A473=\"\",\"\",Données!A473)","v":""},"","","","","","","","","","","","","","","","","",{"$f":"IF(ISERROR(IF(COUNTIF(INDIRECT(\"'\"&$I472&\"'!$D$5:$D$80\"),AA$1)>0,1,\"\")),\"\",IF(COUNTIF(INDIRECT(\"'\"&$I472&\"'!$D$5:$D$80\"),AA$1)>0,1,\"\"))","v":""},"","","","","","","","","","","","","","","","","","",""]
[null,null,null,null,null,null,null,null,{"$f":"IF(Données!A474=\"\",\"\",Données!A474)","v":""},"","",{"$f":"IF(ISERROR(IF(COUNTIF(INDIRECT(\"'\"&$I473&\"'!$D$5:$D$80\"),L$1)>0,1,\"\")),\"\",IF(COUNTIF(INDIRECT(\"'\"&$I473&\"'!$D$5:$D$80\"),L$1)>0,1,\"\"))","v":""},"","","","","","","","","","","","","","","","","","","","","","","","","","","","","","","","","",""]
[null,null,null,null,null,null,null,null,{"$f":"IF(Données!A475=\"\",\"\",Données!A475)","v":""},"","","","","","","","","","","","","","","","","","","","","","","","","","","","","","","","","","","","",""]
[null,null,null,null,null,null,null,null,{"$f":"IF(Données!A476=\"\",\"\",Données!A476)","v":""},"","","","","","","","","","","","","","","","","","","","","","","","","","","","","","","","","","","","",""]
[null,null,null,null,null,null,null,null,{"$f":"IF(Données!A477=\"\",\"\",Données!A477)","v":""},"","","","","","","","","","","","","","","","","","","","","","","","","","","","","","","","","","","","",""]
[null,null,null,null,null,null,null,null,{"$f":"IF(Données!A478=\"\",\"\",Données!A478)","v":""},"","","","","","","","","","","","","","","","","","","","","","","","","","","","","","","","","","","","",""]
[null,null,null,null,null,null,null,null,{"$f":"IF(Données!A479=\"\",\"\",Données!A479)","v":""},"","","","","","","","","","","","","","","","","","","","","","","","","","","","","","","","","","","","",""]
[null,null,null,null,null,null,null,null,{"$f":"IF(Données!A480=\"\",\"\",Données!A480)","v":""},"","","","","","","","","","","","","","","","","","","","","","","","","","","","","","","","","","","","",""]
[null,null,null,null,null,null,null,null,{"$f":"IF(Données!A481=\"\",\"\",Données!A481)","v":""},"","","","","","","","","","","","","","","","","","","","","","","","","","","","","","","","","","","","",""]
[null,null,null,null,null,null,null,null,{"$f":"IF(Données!A482=\"\",\"\",Données!A482)","v":""},"","","","","","","","","","","","","","","","","","","","","","","","","","","","","","","","","","","","",""]
[null,null,null,null,null,null,null,null,{"$f":"IF(Données!A483=\"\",\"\",Données!A483)","v":""},"","","","","","","","","","","","","","","","","","","","","","","","","","","","","","","","","","","","",""]
[null,null,null,null,null,null,null,null,{"$f":"IF(Données!A484=\"\",\"\",Données!A484)","v":""},"","","","","","","","","","","","","","","","","","","","","","","","","","","","","","","","","","","","",""]
[null,null,null,null,null,null,null,null,{"$f":"IF(Données!A485=\"\",\"\",Données!A485)","v":""},"","","","","","","","","","","","","","","","","","","","","","","","","","","","","","","","","","","","",""]
[null,null,null,null,null,null,null,null,{"$f":"IF(Données!A486=\"\",\"\",Données!A486)","v":""},"","","","","","","","","","","","","","","","","","","","","","","","","","","","","","","","","","","","",""]
[null,null,null,null,null,null,null,null,{"$f":"IF(Données!A487=\"\",\"\",Données!A487)","v":""},"","","","","","","","","","","","","","","","","","","","","","","","","","","","","","","","","","","","",""]
[null,null,null,null,null,null,null,null,{"$f":"IF(Données!A488=\"\",\"\",Données!A488)","v":""},"","","","","","","","","","","","","","","","","","","","","","","","","","","","","","","","","","","","",""]
[null,null,null,null,null,null,null,null,{"$f":"IF(Données!A489=\"\",\"\",Données!A489)","v":""},"","","","","","","","","","","","","","","","","",{"$f":"IF(ISERROR(IF(COUNTIF(INDIRECT(\"'\"&$I488&\"'!$D$5:$D$80\"),AA$1)>0,1,\"\")),\"\",IF(COUNTIF(INDIRECT(\"'\"&$I488&\"'!$D$5:$D$80\"),AA$1)>0,1,\"\"))","v":""},"","","","","","","","","","","","","","","","","","",""]
[null,null,null,null,null,null,null,null,{"$f":"IF(Données!A490=\"\",\"\",Données!A490)","v":""},"",{"$f":"IF(ISERROR(INDIRECT(\"'\"&$I489&\"'!$j$77\")),\"\",INDIRECT(\"'\"&$I489&\"'!$j$77\"))","v":""},{"$f":"IF(ISERROR(IF(COUNTIF(INDIRECT(\"'\"&$I489&\"'!$D$5:$D$80\"),L$1)>0,1,\"\")),\"\",IF(COUNTIF(INDIRECT(\"'\"&$I489&\"'!$D$5:$D$80\"),L$1)>0,1,\"\"))","v":""},"","","","","","","","","","","","","","","","","","","","","","","","","","","","","","","","","",""]
[null,null,null,null,null,null,null,null,{"$f":"IF(Données!A491=\"\",\"\",Données!A491)","v":""},"","","","","","","","","","","","","","","","","","","","","","","","","","","","","","","","","","","","",""]
[null,null,null,null,null,null,null,null,{"$f":"IF(Données!A492=\"\",\"\",Données!A492)","v":""},"","","","","","","","","","","","","","","","","","","","","","","","","","","","","","","","","","","","",""]
[null,null,null,null,null,null,null,null,{"$f":"IF(Données!A493=\"\",\"\",Données!A493)","v":""},"","","","","","","","","","","","","","","","","","","","","","","","","","","","","","","","","","","","",""]
[null,null,null,null,null,null,null,null,{"$f":"IF(Données!A494=\"\",\"\",Données!A494)","v":""},"","","","","","","","","","","","","","","","","","","","","","","","","","","","","","","","","","","","",""]
[null,null,null,null,null,null,null,null,{"$f":"IF(Données!A495=\"\",\"\",Données!A495)","v":""},"","","","","","","","","","","","","","","","","","","","","","","","","","","","","","","","","","","","",""]
[null,null,null,null,null,null,null,null,{"$f":"IF(Données!A496=\"\",\"\",Données!A496)","v":""},"","","","","","","","","","","","","","","","","","","","","","","","","","","","","","","","","","","","",""]
[null,null,null,null,null,null,null,null,{"$f":"IF(Données!A497=\"\",\"\",Données!A497)","v":""},"","","","","","","","","","","","","","","","","","","","","","","","","","","","","","","","","","","","",""]
[null,null,null,null,null,null,null,null,{"$f":"IF(Données!A498=\"\",\"\",Données!A498)","v":""},"","","","","","","","","","","","","","","","","","","","","","","","","","","","","",{"$f":"IF(AM$1=\"\",\"\",IF(ISERROR(IF(COUNTIF(INDIRECT(\"'\"&$I497&\"'!$D$5:$D$80\"),AM$1)>0,1,\"\")),\"\",IF(COUNTIF(INDIRECT(\"'\"&$I497&\"'!$D$5:$D$80\"),AM$1)>0,1,\"\")))","v":""},"","","","","","",""]
[null,null,null,null,null,null,null,null,{"$f":"IF(Données!A499=\"\",\"\",Données!A499)","v":""},"","","","","","","","","","","","","","","","","","","","","","","","","","","","","","","","","","","","",""]
[null,null,null,null,null,null,null,null,{"$f":"IF(Données!A500=\"\",\"\",Données!A500)","v":""},"","","","","","","","","","","","","","","","","","","","","","","","","","","","","","","","","","","","",""]
[null,null,null,null,null,null,null,null,{"$f":"IF(Données!A501=\"\",\"\",Données!A501)","v":""},"","","","","","","","","","","","","","","","","","","","","","","","","","","","","","","","","","","","",""]
[null,null,null,null,null,null,null,null,{"$f":"IF(Données!A502=\"\",\"\",Données!A502)","v":""},"","","","","","","","","","","","","","","","","","","","","","","","","","","","","","","","","","","","",""]
[null,null,null,null,null,null,null,null,{"$f":"IF(Données!A503=\"\",\"\",Données!A503)","v":""},"","","","","","","","","","","","","","","","","","","","","","","","","","","","","","","","","","","","",""]
[null,null,null,null,null,null,null,null,{"$f":"IF(Données!A504=\"\",\"\",Données!A504)","v":""},"","","","","","","","","","","","","","","","","","","","","","","","","","","","","","","","","","","","",""]
[null,null,null,null,null,null,null,null,{"$f":"IF(Données!A505=\"\",\"\",Données!A505)","v":""},"","","","","","","","","","","","","","","","","",{"$f":"IF(ISERROR(IF(COUNTIF(INDIRECT(\"'\"&$I504&\"'!$D$5:$D$80\"),AA$1)>0,1,\"\")),\"\",IF(COUNTIF(INDIRECT(\"'\"&$I504&\"'!$D$5:$D$80\"),AA$1)>0,1,\"\"))","v":""},"","","","","","","","","","","","","","","","","","",""]
[null,null,null,null,null,null,null,null,{"$f":"IF(Données!A506=\"\",\"\",Données!A506)","v":""},"","",{"$f":"IF(ISERROR(IF(COUNTIF(INDIRECT(\"'\"&$I505&\"'!$D$5:$D$80\"),L$1)>0,1,\"\")),\"\",IF(COUNTIF(INDIRECT(\"'\"&$I505&\"'!$D$5:$D$80\"),L$1)>0,1,\"\"))","v":""},"","","","","","","","","","","","","","","","","","","","","","","","","","","","","","","","","",""]
[null,null,null,null,null,null,null,null,{"$f":"IF(Données!A507=\"\",\"\",Données!A507)","v":""},"","","","","","","","","","","","","","","","","","","","","","","","","","","","","","","","","","","","",""]
[null,null,null,null,null,null,null,null,{"$f":"IF(Données!A508=\"\",\"\",Données!A508)","v":""},"","","","","","","","","","","","","","","","","","","","","","","","","","","","","","","","","","","","",""]
[null,null,null,null,null,null,null,null,{"$f":"IF(Données!A509=\"\",\"\",Données!A509)","v":""},"","","","","","","","","","","","","","","","","","","","","","","","","","","","","","","","","","","","",""]
[null,null,null,null,null,null,null,null,{"$f":"IF(Données!A510=\"\",\"\",Données!A510)","v":""},"","","","","","","","","","","","","","","","","","","","","","","","","","","","","","","","","","","","",""]
[null,null,null,null,null,null,null,null,{"$f":"IF(Données!A511=\"\",\"\",Données!A511)","v":""},"","","","","","","","","","","","","","","","","","","","","","","","","","","","","","","","","","","","",""]
[null,null,null,null,null,null,null,null,{"$f":"IF(Données!A512=\"\",\"\",Données!A512)","v":""},"","","","","","","","","","","","","","","","","","","","","","","","","","","","","","","","","","","","",""]
[null,null,null,null,null,null,null,null,{"$f":"IF(Données!A513=\"\",\"\",Données!A513)","v":""},"","","","","","","","","","","","","","","","","","","","","","","","","","","","","","","","","","","","",""]
[null,null,null,null,null,null,null,null,{"$f":"IF(Données!A514=\"\",\"\",Données!A514)","v":""},"","","","","","","","","","","","","","","","","","","","","","","","","","","","","","","","","","","","",""]
[null,null,null,null,null,null,null,null,{"$f":"IF(Données!A515=\"\",\"\",Données!A515)","v":""},"","","","","","","","","","","","","","","","","","","","","","","","","","","","","","","","","","","","",""]
[null,null,null,null,null,null,null,null,{"$f":"IF(Données!A516=\"\",\"\",Données!A516)","v":""},{"$f":"IF(SUM(L515:AT515)=0,\"\",SUM(L515:AT515))","v":""},"","","","","","","","","","","","","","","","","","","","","","","","","","","","","","","","","","","",""]
[null,null,null,null,null,null,null,null,{"$f":"IF(Données!A517=\"\",\"\",Données!A517)","v":""},"","","","","","","","","","","","","","","","","","","","","","","","","","","","","","","","","","","","",""]
[null,null,null,null,null,null,null,null,{"$f":"IF(Données!A518=\"\",\"\",Données!A518)","v":""},"","","","","","","","","","","","","","","","","","","","","","","","","","","","","","","","","","","","",""]
[null,null,null,null,null,null,null,null,{"$f":"IF(Données!A519=\"\",\"\",Données!A519)","v":""},"","","","","","","","","","","","","","","","","","","","","","","","","","","","","","","","","","","","",""]
[null,null,null,null,null,null,null,null,{"$f":"IF(Données!A520=\"\",\"\",Données!A520)","v":""},"","","","","","","","","","","","","","","","","","","","","","","","","","","","","","","","","","","","",""]
[null,null,null,null,null,null,null,null,{"$f":"IF(Données!A521=\"\",\"\",Données!A521)","v":""},"","","","","","","","","","","","","","","","","",{"$f":"IF(ISERROR(IF(COUNTIF(INDIRECT(\"'\"&$I520&\"'!$D$5:$D$80\"),AA$1)>0,1,\"\")),\"\",IF(COUNTIF(INDIRECT(\"'\"&$I520&\"'!$D$5:$D$80\"),AA$1)>0,1,\"\"))","v":""},"","","","","","","","","","","","","","","","","","",""]
[null,null,null,null,null,null,null,null,{"$f":"IF(Données!A522=\"\",\"\",Données!A522)","v":""},"","",{"$f":"IF(ISERROR(IF(COUNTIF(INDIRECT(\"'\"&$I521&\"'!$D$5:$D$80\"),L$1)>0,1,\"\")),\"\",IF(COUNTIF(INDIRECT(\"'\"&$I521&\"'!$D$5:$D$80\"),L$1)>0,1,\"\"))","v":""},"","","","","","","","","","","","","","","","","","","","","","","","","","","","","","","","","",""]
[null,null,null,null,null,null,null,null,{"$f":"IF(Données!A523=\"\",\"\",Données!A523)","v":""},"","","","","","","","","","","","","","","","","","","","","","","","","","","","","","","","","","","","",""]
[null,null,null,null,null,null,null,null,{"$f":"IF(Données!A524=\"\",\"\",Données!A524)","v":""},"","","","","","","","","","","","","","","","","","","","","","","","","","","","","","","","","","","","",""]
[null,null,null,null,null,null,null,null,{"$f":"IF(Données!A525=\"\",\"\",Données!A525)","v":""},"","","","","","","","","","","","","","","","","","","","","","","","","","","","","","","","","","","","",""]
[null,null,null,null,null,null,null,null,{"$f":"IF(Données!A526=\"\",\"\",Données!A526)","v":""},"","","","","","","","","","","","","","","","","","","","","","","","","","","","","","","","",{"$f":"IF(AP$1=\"\",\"\",IF(ISERROR(IF(COUNTIF(INDIRECT(\"'\"&$I525&\"'!$D$5:$D$80\"),AP$1)>0,1,\"\")),\"\",IF(COUNTIF(INDIRECT(\"'\"&$I525&\"'!$D$5:$D$80\"),AP$1)>0,1,\"\")))","v":""},"","","",""]
[null,null,null,null,null,null,null,null,{"$f":"IF(Données!A527=\"\",\"\",Données!A527)","v":""},"","","","","","","","","","","","","","","","","","","","","","","","","","","","","","","","","","","","",""]
[null,null,null,null,null,null,null,null,{"$f":"IF(Données!A528=\"\",\"\",Données!A528)","v":""},"","","","","","","","","","","","","","","","","","","","","","","","","","","","","","","","","","","","",""]
[null,null,null,null,null,null,null,null,{"$f":"IF(Données!A529=\"\",\"\",Données!A529)","v":""},"","","","","","","","","","","","","","","","","","","","","","","","","","","","","","","","","","","","",""]
[null,null,null,null,null,null,null,null,{"$f":"IF(Données!A530=\"\",\"\",Données!A530)","v":""},"","","","","","","","","","","","","","","","","","","","","","","","","","","","","","","","","","","","",""]
[null,null,null,null,null,null,null,null,{"$f":"IF(Données!A531=\"\",\"\",Données!A531)","v":""},"","","","","","","","","","","","","","","","","","","","","","","","","","","","","","","","","","","","",""]
[null,null,null,null,null,null,null,null,{"$f":"IF(Données!A532=\"\",\"\",Données!A532)","v":""},"","","","","","","","","","","","","","","","","","","","","","","","","","","","","","","","","","","","",""]
[null,null,null,null,null,null,null,null,{"$f":"IF(Données!A533=\"\",\"\",Données!A533)","v":""},"","","","","","","","","","","","","","","","","","","","","","","","","","","","","","","","","","","","",""]
[null,null,null,null,null,null,null,null,{"$f":"IF(Données!A534=\"\",\"\",Données!A534)","v":""},"","","","","","","","","","","","","","","","","","","","","","","","","","","","","","","","","","","","",""]
[null,null,null,null,null,null,null,null,{"$f":"IF(Données!A535=\"\",\"\",Données!A535)","v":""},"","","","","","","","","","","","","","","","","","","","","","","","","","","","","","","","","","","","",""]
[null,null,null,null,null,null,null,null,{"$f":"IF(Données!A536=\"\",\"\",Données!A536)","v":""},"","","","","","","","","","","","","","","","","","","","","","","","","","","","","","","","","","","","",""]
[null,null,null,null,null,null,null,null,{"$f":"IF(Données!A537=\"\",\"\",Données!A537)","v":""},"","","","","","","","","","","","","","","","","",{"$f":"IF(ISERROR(IF(COUNTIF(INDIRECT(\"'\"&$I536&\"'!$D$5:$D$80\"),AA$1)>0,1,\"\")),\"\",IF(COUNTIF(INDIRECT(\"'\"&$I536&\"'!$D$5:$D$80\"),AA$1)>0,1,\"\"))","v":""},"","","","","","","","","","","","","","","","","","",""]
[null,null,null,null,null,null,null,null,{"$f":"IF(Données!A538=\"\",\"\",Données!A538)","v":""},"","",{"$f":"IF(ISERROR(IF(COUNTIF(INDIRECT(\"'\"&$I537&\"'!$D$5:$D$80\"),L$1)>0,1,\"\")),\"\",IF(COUNTIF(INDIRECT(\"'\"&$I537&\"'!$D$5:$D$80\"),L$1)>0,1,\"\"))","v":""},"","","","","","","","","","","","","","","","","","","","","","","","","","","","","","","","","",""]
[null,null,null,null,null,null,null,null,{"$f":"IF(Données!A539=\"\",\"\",Données!A539)","v":""},"","","","","","","","","","","","","","","","","","","","","","","","","","","","","","","","","","","","",""]
[null,null,null,null,null,null,null,null,{"$f":"IF(Données!A540=\"\",\"\",Données!A540)","v":""},"","","","","","","","","","","","","","","","","","","","","","","","","","","","","","","","","","","","",""]
[null,null,null,null,null,null,null,null,{"$f":"IF(Données!A541=\"\",\"\",Données!A541)","v":""},"","","","","","","","","","","","","","","","","","","","","","","","","","","","","","","","","","","","",""]
[null,null,null,null,null,null,null,null,{"$f":"IF(Données!A542=\"\",\"\",Données!A542)","v":""},"","","","","","","","","","","","","","","","","","","","","","","","","","","","","","","","","","","","",""]
[null,null,null,null,null,null,null,null,{"$f":"IF(Données!A543=\"\",\"\",Données!A543)","v":""},"","","","","","","","","","","","","","","","","","","","","","","","","","","","","","","","","","","","",""]
[null,null,null,null,null,null,null,null,{"$f":"IF(Données!A544=\"\",\"\",Données!A544)","v":""},"","","","","","","","","","","","","","","","","","","","","","","","","","","","","","","","","","","","",""]
[null,null,null,null,null,null,null,null,{"$f":"IF(Données!A545=\"\",\"\",Données!A545)","v":""},"","","","","","","","","","","","","","","","","","","","","","","","","","","","","","","","","","","","",""]
[null,null,null,null,null,null,null,null,{"$f":"IF(Données!A546=\"\",\"\",Données!A546)","v":""},"","","","","","","","","","","","","","","","","","","","","","","","","","","","","","","","","","","","",""]
[null,null,null,null,null,null,null,null,{"$f":"IF(Données!A547=\"\",\"\",Données!A547)","v":""},"","","","","","","","","","","","","","","","","","","","","","","","","","","","","","","","","","","","",""]
[null,null,null,null,null,null,null,null,{"$f":"IF(Données!A548=\"\",\"\",Données!A548)","v":""},"","","","","","","","","","","","","","","","","","","","","","","","","","","","","","","","","","","","",""]
[null,null,null,null,null,null,null,null,{"$f":"IF(Données!A549=\"\",\"\",Données!A549)","v":""},"","","","","","","","","","","","","","","","","","","","","","","","","","","","","","","","","","","","",""]
[null,null,null,null,null,null,null,null,{"$f":"IF(Données!A550=\"\",\"\",Données!A550)","v":""},"","","","","","","","","","","","","","","","","","","","","","","","","","","","","","","","","","","","",""]
[null,null,null,null,null,null,null,null,{"$f":"IF(Données!A551=\"\",\"\",Données!A551)","v":""},"","","","","","","","","","","","","","","","","","","","","","","","","","","","","","","","","","","","",""]
[null,null,null,null,null,null,null,null,{"$f":"IF(Données!A552=\"\",\"\",Données!A552)","v":""},"","","",{"$f":"IF(ISERROR(IF(COUNTIF(INDIRECT(\"'\"&$I551&\"'!$D$5:$D$80\"),M$1)>0,1,\"\")),\"\",IF(COUNTIF(INDIRECT(\"'\"&$I551&\"'!$D$5:$D$80\"),M$1)>0,1,\"\"))","v":""},"","","","","","","","","","","","","","","","","","","","","","","","","","","","","","","","",""]
[null,null,null,null,null,null,null,null,{"$f":"IF(Données!A553=\"\",\"\",Données!A553)","v":""},"","","","","","","","","","","","","","","","","","","","","","","","","","","","","","","","","","","","",""]
[null,null,null,null,null,null,null,null,{"$f":"IF(Données!A554=\"\",\"\",Données!A554)","v":""},"",{"$f":"IF(ISERROR(INDIRECT(\"'\"&$I553&\"'!$j$77\")),\"\",INDIRECT(\"'\"&$I553&\"'!$j$77\"))","v":""},"","","","","","","","","","","","","","","","","","","","","","","","","","","","","","","","","",{"$f":"IF(AS$1=\"\",\"\",IF(ISERROR(IF(COUNTIF(INDIRECT(\"'\"&$I553&\"'!$D$5:$D$80\"),AS$1)>0,1,\"\")),\"\",IF(COUNTIF(INDIRECT(\"'\"&$I553&\"'!$D$5:$D$80\"),AS$1)>0,1,\"\")))","v":""},""]
[null,null,null,null,null,null,null,null,{"$f":"IF(Données!A555=\"\",\"\",Données!A555)","v":""},"","","","","","","","","","","","","","","","","","","","","","","","","","","","","","","","","","","","",""]
[null,null,null,null,null,null,null,null,{"$f":"IF(Données!A556=\"\",\"\",Données!A556)","v":""},"","","","","","","","","","","","","","","","","","","","","","","","","","","","","","","","","","","","",""]
[null,null,null,null,null,null,null,null,{"$f":"IF(Données!A557=\"\",\"\",Données!A557)","v":""},"","","","","","","","","","","","","","","","","","","","","","","","","","","","","","","","","","","","",""]
[null,null,null,null,null,null,null,null,{"$f":"IF(Données!A558=\"\",\"\",Données!A558)","v":""},"","","","","","","","","","","","","","","","","","","","","","","","","","","","","","","","","","","","",""]
[null,null,null,null,null,null,null,null,{"$f":"IF(Données!A559=\"\",\"\",Données!A559)","v":""},"","","","","","","","","","","","","","","","","","","",{"$f":"IF(ISERROR(IF(COUNTIF(INDIRECT(\"'\"&$I558&\"'!$D$5:$D$80\"),AC$1)>0,1,\"\")),\"\",IF(COUNTIF(INDIRECT(\"'\"&$I558&\"'!$D$5:$D$80\"),AC$1)>0,1,\"\"))","v":""},"","","","","","","","","","","","","","","","",""]
[null,null,null,null,null,null,null,null,{"$f":"IF(Données!A560=\"\",\"\",Données!A560)","v":""},"","","","","","","","","","","","","","","","","","",{"$f":"IF(ISERROR(IF(COUNTIF(INDIRECT(\"'\"&$I559&\"'!$D$5:$D$80\"),AB$1)>0,1,\"\")),\"\",IF(COUNTIF(INDIRECT(\"'\"&$I559&\"'!$D$5:$D$80\"),AB$1)>0,1,\"\"))","v":""},"","","","","","","","","","","","","","","","","",""]
[null,null,null,null,null,null,null,null,{"$f":"IF(Données!A561=\"\",\"\",Données!A561)","v":""},"","","","","","","","","",{"$f":"IF(ISERROR(IF(COUNTIF(INDIRECT(\"'\"&$I560&\"'!$D$5:$D$80\"),S$1)>0,1,\"\")),\"\",IF(COUNTIF(INDIRECT(\"'\"&$I560&\"'!$D$5:$D$80\"),S$1)>0,1,\"\"))","v":""},"","","","","","","","","","","","","","","","","","","","","","","","","","",""]
[null,null,null,null,null,null,null,null,{"$f":"IF(Données!A562=\"\",\"\",Données!A562)","v":""},"","",{"$f":"IF(ISERROR(IF(COUNTIF(INDIRECT(\"'\"&$I561&\"'!$D$5:$D$80\"),L$1)>0,1,\"\")),\"\",IF(COUNTIF(INDIRECT(\"'\"&$I561&\"'!$D$5:$D$80\"),L$1)>0,1,\"\"))","v":""},"","","","","","","","","","","","","","","","","","","","","","","","","","","","","","","","","",""]
[null,null,null,null,null,null,null,null,{"$f":"IF(Données!A563=\"\",\"\",Données!A563)","v":""},"","","","","","","","","","","","","","","","","","","","","","","","","","","","","","","","","","","","",""]
[null,null,null,null,null,null,null,null,{"$f":"IF(Données!A564=\"\",\"\",Données!A564)","v":""},"","","","","","","","","","","","","","","","","","","","","","","","","","","","","","","","","","","","",""]
[null,null,null,null,null,null,null,null,{"$f":"IF(Données!A565=\"\",\"\",Données!A565)","v":""},"","","","","","","","","","","","","","","","","","","","","","","","","","","","","","","","","","","","",""]
[null,null,null,null,null,null,null,null,{"$f":"IF(Données!A566=\"\",\"\",Données!A566)","v":""},"","","","","","","","","","","","","","","","","","","","","","","","","","","","","","","","","","","","",""]
[null,null,null,null,null,null,null,null,{"$f":"IF(Données!A567=\"\",\"\",Données!A567)","v":""},"","","","","","","","","","","","","","","","","","","","","","","","","","","","","","","","","","","","",""]
[null,null,null,null,null,null,null,null,{"$f":"IF(Données!A568=\"\",\"\",Données!A568)","v":""},"","","","","","","","","","","","","","","","","","","","","","","","","","","","","","","","","","","","",""]
[null,null,null,null,null,null,null,null,{"$f":"IF(Données!A569=\"\",\"\",Données!A569)","v":""},"","","","","","","","","","","","","","","","","","","","","","","","","","","","","","","","","","","","",""]
[null,null,null,null,null,null,null,null,{"$f":"IF(Données!A570=\"\",\"\",Données!A570)","v":""},"","","","","","","","","","","","","","","","","","",{"$f":"IF(ISERROR(IF(COUNTIF(INDIRECT(\"'\"&$I569&\"'!$D$5:$D$80\"),AB$1)>0,1,\"\")),\"\",IF(COUNTIF(INDIRECT(\"'\"&$I569&\"'!$D$5:$D$80\"),AB$1)>0,1,\"\"))","v":""},"","","","","","","","","","","","","","","","","",""]
[null,null,null,null,null,null,null,null,{"$f":"IF(Données!A571=\"\",\"\",Données!A571)","v":""},"","","","","","","","","","","","","","","","","","","","","","","","","","","","","","","","","","","","",""]
[null,null,null,null,null,null,null,null,{"$f":"IF(Données!A572=\"\",\"\",Données!A572)","v":""},"","","","","","","","","","","","","","","","","","","","","","","","","","","","","","","","","","","","",""]
[null,null,null,null,null,null,null,null,{"$f":"IF(Données!A573=\"\",\"\",Données!A573)","v":""},"","","","","","","","","","","","","","","","","","","","","","","","","","","","","","","","","","","","",""]
[null,null,null,null,null,null,null,null,{"$f":"IF(Données!A574=\"\",\"\",Données!A574)","v":""},"","","","","","","","","","","","","","","","","","","","","","","","","","","","","","","","","","","","",""]
[null,null,null,null,null,null,null,null,{"$f":"IF(Données!A575=\"\",\"\",Données!A575)","v":""},"","","","","","","","","","","","","","","","","","","","","","","","","","","","","","","","","","","","",""]
[null,null,null,null,null,null,null,null,{"$f":"IF(Données!A576=\"\",\"\",Données!A576)","v":""},"","","","","","","","","","","","","","","","","","","","","","","","","","","","","","","","","","","","",""]
[null,null,null,null,null,null,null,null,{"$f":"IF(Données!A577=\"\",\"\",Données!A577)","v":""},"","","","","","","","","","","","","","","","","",{"$f":"IF(ISERROR(IF(COUNTIF(INDIRECT(\"'\"&$I576&\"'!$D$5:$D$80\"),AA$1)>0,1,\"\")),\"\",IF(COUNTIF(INDIRECT(\"'\"&$I576&\"'!$D$5:$D$80\"),AA$1)>0,1,\"\"))","v":""},"","","","","","","","","","","","","","","","","","",""]
[null,null,null,null,null,null,null,null,{"$f":"IF(Données!A578=\"\",\"\",Données!A578)","v":""},"","",{"$f":"IF(ISERROR(IF(COUNTIF(INDIRECT(\"'\"&$I577&\"'!$D$5:$D$80\"),L$1)>0,1,\"\")),\"\",IF(COUNTIF(INDIRECT(\"'\"&$I577&\"'!$D$5:$D$80\"),L$1)>0,1,\"\"))","v":""},"","","","","","","","","","","","","","","","","","","","","","","","","","","","","","","","","",""]
[null,null,null,null,null,null,null,null,{"$f":"IF(Données!A579=\"\",\"\",Données!A579)","v":""},"","","","","","","","","","","","","","","","","","","","","","","","","","","","","","","","","","","","",""]
[null,null,null,null,null,null,null,null,{"$f":"IF(Données!A580=\"\",\"\",Données!A580)","v":""},{"$f":"IF(SUM(L579:AT579)=0,\"\",SUM(L579:AT579))","v":""},"","","","","","","","","","","","","","","","","","","","","","","","","","","","","","","","","","","",""]
[null,null,null,null,null,null,null,null,{"$f":"IF(Données!A581=\"\",\"\",Données!A581)","v":""},"","","","","","","","","","","","","","","","","","","","","","","","","","","","","","","","","","","","",""]
[null,null,null,null,null,null,null,null,{"$f":"IF(Données!A582=\"\",\"\",Données!A582)","v":""},"","","","","","","","","","","","","","","","","","","","","","","","","","","","","","","","","","","","",""]
[null,null,null,null,null,null,null,null,{"$f":"IF(Données!A583=\"\",\"\",Données!A583)","v":""},"","","","","","","","","","","","","","","","","","","","","","","","","","","","","",{"$f":"IF(AM$1=\"\",\"\",IF(ISERROR(IF(COUNTIF(INDIRECT(\"'\"&$I582&\"'!$D$5:$D$80\"),AM$1)>0,1,\"\")),\"\",IF(COUNTIF(INDIRECT(\"'\"&$I582&\"'!$D$5:$D$80\"),AM$1)>0,1,\"\")))","v":""},"","","","","","",""]
[null,null,null,null,null,null,null,null,{"$f":"IF(Données!A584=\"\",\"\",Données!A584)","v":""},"","","","","","","","","","","","","","","","","","","","","","","","","","","","","","","","","","","","",""]
[null,null,null,null,null,null,null,null,{"$f":"IF(Données!A585=\"\",\"\",Données!A585)","v":""},"","","","","","","","","","","","","","","","","","","","","","","","","","","","","","","","","","","","",""]
[null,null,null,null,null,null,null,null,{"$f":"IF(Données!A586=\"\",\"\",Données!A586)","v":""},"","","","","","","","","","","","","","","","","","","","","","","","","","","","","","","","","","","","",""]
[null,null,null,null,null,null,null,null,{"$f":"IF(Données!A587=\"\",\"\",Données!A587)","v":""},"","","","","","","","","","","","","","","","","","","","","","","","","","","","","","","","","","","","",""]
[null,null,null,null,null,null,null,null,{"$f":"IF(Données!A588=\"\",\"\",Données!A588)","v":""},"","","","","","","","","","","","","","","","","","","","","","","","","","","","","","","","","","","","",""]
[null,null,null,null,null,null,null,null,{"$f":"IF(Données!A589=\"\",\"\",Données!A589)","v":""},"","","","","","","","","","","","","","","","","","","","","","","","","","","","","","","","","","","","",""]
[null,null,null,null,null,null,null,null,{"$f":"IF(Données!A590=\"\",\"\",Données!A590)","v":""},"","","","","","","","","","","","","","","","","","","","","","","","","","","","","","","","","","","","",""]
[null,null,null,null,null,null,null,null,{"$f":"IF(Données!A591=\"\",\"\",Données!A591)","v":""},"","","","","","","","","","","","","","","","","","","","","","","","","","","","","","","","","","","","",""]
[null,null,null,null,null,null,null,null,{"$f":"IF(Données!A592=\"\",\"\",Données!A592)","v":""},"","","","","","","","","","","","","","","","","","","","","","","","","","","","","","","","","","","","",""]
[null,null,null,null,null,null,null,null,{"$f":"IF(Données!A593=\"\",\"\",Données!A593)","v":""},"","","","","","","","","","","","","","","","","",{"$f":"IF(ISERROR(IF(COUNTIF(INDIRECT(\"'\"&$I592&\"'!$D$5:$D$80\"),AA$1)>0,1,\"\")),\"\",IF(COUNTIF(INDIRECT(\"'\"&$I592&\"'!$D$5:$D$80\"),AA$1)>0,1,\"\"))","v":""},"","","","","","","","","","","","","","","","","","",""]
[null,null,null,null,null,null,null,null,{"$f":"IF(Données!A594=\"\",\"\",Données!A594)","v":""},"","",{"$f":"IF(ISERROR(IF(COUNTIF(INDIRECT(\"'\"&$I593&\"'!$D$5:$D$80\"),L$1)>0,1,\"\")),\"\",IF(COUNTIF(INDIRECT(\"'\"&$I593&\"'!$D$5:$D$80\"),L$1)>0,1,\"\"))","v":""},"","","","","","","","","","","","","","","","","","","","","","","","","","","","","","","","","",""]
[null,null,null,null,null,null,null,null,{"$f":"IF(Données!A595=\"\",\"\",Données!A595)","v":""},"","","","","","","","","","","","","","","","","","","","","","","","","","","","","","","","","","","","",""]
[null,null,null,null,null,null,null,null,{"$f":"IF(Données!A596=\"\",\"\",Données!A596)","v":""},"","","","","","","","","","","","","","","","","","","","","","","","","","","","","","","","","","","","",""]
[null,null,null,null,null,null,null,null,{"$f":"IF(Données!A597=\"\",\"\",Données!A597)","v":""},"","","","","","","","","","","","","","","","","","","","","","","","","","","","","","","","","","","","",""]
[null,null,null,null,null,null,null,null,{"$f":"IF(Données!A598=\"\",\"\",Données!A598)","v":""},"","","","","","","","","","","","","","","","","","","","","","","","","","","","","","","","","","","","",""]
[null,null,null,null,null,null,null,null,{"$f":"IF(Données!A599=\"\",\"\",Données!A599)","v":""},"","","","","","","","","","","","","","","","","","","","","","","","","","","","","","","","","","","","",""]
[null,null,null,null,null,null,null,null,{"$f":"IF(Données!A600=\"\",\"\",Données!A600)","v":""},"","","","","","","","","","","","","","","","","","","","","","","","","","","","","","","","","","","","",""]
[null,null,null,null,null,null,null,null,{"$f":"IF(Données!A601=\"\",\"\",Données!A601)","v":""},{"$f":"IF(SUM(L600:AT600)=0,\"\",SUM(L600:AT600))","v":""},"","","","","","","","","","","","","","","","","","","","","","","","","","","","","","","","","","","",""]
[null,null,null,null,null,null,null,null,"Total",null,null,{"$f":"SUM(L2:L600)","v":22},{"$f":"SUM(M2:M600)","v":3},3,17,1,14,2,2,2,16,1,2,21,7,0,4,9,8,11,9,1,22,1,0,20,8,2,8,5,1,0,0,0,0,0]

{"sheet":"VANUATU","index":4,"n_rows":83,"n_cols":10,"rows_kept":83,"cut":false,"hidden":false,"merged":[[0,3,0,5],[2,1,3,1],[2,2,3,2],[2,3,3,3],[2,4,2,5],[2,7,3,7],[4,0,9,0],[4,2,9,2],[10,0,15,0],[10,2,15,2],[16,0,21,0],[16,2,21,2],[2,6,3,6],[58,0,63,0],[58,2,63,2],[22,0,27,0],[22,2,27,2],[28,0,33,0],[28,2,33,2],[34,0,39,0],[34,2,39,2],[64,0,69,0],[64,2,69,2],[70,0,75,0],[70,2,75,2],[40,0,45,0],[40,2,45,2],[46,0,51,0],[46,2,51,2],[52,0,57,0],[52,2,57,2]]}
["R","DNB 2014","VANUATU","CLG LE CLEZIO VANUATU",null,null,"VANUATU","Académie de Nouvelle-Calédonie",{"$f":"IF(C1=\"\",\"\",VLOOKUP(C1,etab,4,FALSE))","v":"public"}]
["GEBEPS_2014_IPR_PROTOCOLES_public_VANUATU.xls",null,null,null,"",null,null,null,{"$f":"Données!M11","v":"V3_29/10/13"}]
[null,"CLASSES            évaluées pour le DNB","NOM \nde l'enseignant responsable de la classe","Activités","Compétences\npropres",null,"dates des évaluations","dates des rattrapages",null,"nbre APSA\n/ classe"]
[null,null,null,null,"CP","Liste"]
["Classe 1","Classe","prof1","Hand","CP4","N","2014-04-17","2014-09-25",{"$f":"IF(ISERROR(E5),1,\"\")","v":""},{"$f":"IF(COUNTA(D5:D10)<=2,\"\",COUNTA(D5:D10))","v":3}]
[null,"3è1",null,"CO","CP2","N","2014-06-26","2014-09-25",{"$f":"IF(ISERROR(E6),1,\"\")","v":""}]
[null,null,null,"Relais-vitesse","CP1","N","2014-08-14","2014-09-25",""]
[null,"nbre d'élèves :   ",null,null,"","",null,null,""]
[null,30,null,null,"","",null,null,""]
[null,null,null,null,"","",null,null,""]
["Classe 2","Classe","prof2",null,"","",null,null,"",{"$f":"IF(COUNTA(D11:D16)<=2,\"\",COUNTA(D11:D16))","v":""}]
[null,"3è2",null,null,"","",null,null,""]
[null,null,null,null,"","",null,null,""]
[null,"nbre d'élèves :   ",null,null,"","",null,null,""]
[null,null,null,null,"","",null,null,""]
[null,null,null,null,"","",null,null,""]
["Classe 3","Classe","prof3",null,"","",null,null,"",{"$f":"IF(COUNTA(D17:D22)<=2,\"\",COUNTA(D17:D22))","v":""}]
[null,"3è3",null,null,"","",null,null,""]
[null,null,null,null,"","",null,null,""]
[null,"nbre d'élèves :   ",null,null,"","",null,null,""]
[null,null,null,null,"","",null,null,""]
[null,null,null,null,"","",null,null,""]
["Classe 4","Classe","prof4",null,"","",null,null,"",{"$f":"IF(COUNTA(D23:D28)<=2,\"\",COUNTA(D23:D28))","v":""}]
[null,"3è4",null,null,"","",null,null,""]
[null,null,null,null,"","",null,null,""]
[null,"nbre d'élèves :   ",null,null,"","",null,null,""]
[null,null,null,null,"","",null,null,""]
[null,null,null,null,"","",null,null,""]
["Classe 5","Classe","prof5",null,"","",null,null,"",{"$f":"IF(COUNTA(D29:D34)<=2,\"\",COUNTA(D29:D34))","v":""}]
[null,"3è5",null,null,"","",null,null,""]
[null,null,null,null,"","",null,null,""]
[null,"nbre d'élèves :   ",null,null,"","",null,null,""]
[null,null,null,null,"","",null,null,""]
[null,null,null,null,"","",null,null,""]
["Classe 6","Classe","prof6",null,"","",null,null,"",{"$f":"IF(COUNTA(D35:D40)<=2,\"\",COUNTA(D35:D40))","v":""}]
[null,"3è6",null,null,"","",null,null,""]
[null,null,null,null,"","",null,null,""]
[null,"nbre d'élèves :   ",null,null,"","",null,null,""]
[null,null,null,null,"","",null,null,""]
[null,null,null,null,"","",null,null,""]
["Classe 7","Classe","prof7",null,"","",null,null,{"$f":"IF(ISERROR(E41),1,\"\")","v":""},{"$f":"IF(COUNTA(D41:D46)<=2,\"\",COUNTA(D41:D46))","v":""}]
[null,"3è7",null,null,"","",null,null,{"$f":"IF(ISERROR(E42),1,\"\")","v":""}]
[null,null,null,null,"","",null,null,""]
[null,"nbre d'élèves :   ",null,null,"","",null,null,""]
[null,null,null,null,"","",null,null,""]
[null,null,null,null,"","",null,null,""]
["Classe 8","Classe","prof8",null,"","",null,null,"",{"$f":"IF(COUNTA(D47:D52)<=2,\"\",COUNTA(D47:D52))","v":""}]
[null,"3è8",null,null,"","",null,null,""]
[null,null,null,null,"","",null,null,""]
[null,"nbre d'élèves :   ",null,null,"","",null,null,""]
[null,null,null,null,"","",null,null,""]
[null,null,null,null,"","",null,null,""]
["Classe 9","Classe","prof9",null,"","",null,null,"",{"$f":"IF(COUNTA(D53:D58)<=2,\"\",COUNTA(D53:D58))","v":""}]
[null,"3è9",null,null,"","",null,null,""]
[null,null,null,null,"","",null,null,""]
[null,"nbre d'élèves :   ",null,null,"","",null,null,""]
[null,null,null,null,"","",null,null,""]
[null,null,null,null,"","",null,null,""]
["Classe 10","Classe","prof10",null,"","",null,null,"",{"$f":"IF(COUNTA(D59:D64)<=2,\"\",COUNTA(D59:D64))","v":""}]
[null,"3è10",null,null,"","",null,null,""]
[null,null,null,null,"","",null,null,""]
[null,"nbre d'élèves :   ",null,null,"","",null,null,""]
[null,null,null,null,"","",null,null,""]
[null,null,null,null,"","",null,null,""]
["Classe 11","Classe","prof11",null,"","",null,null,"",{"$f":"IF(COUNTA(D65:D70)<=2,\"\",COUNTA(D65:D70))","v":""}]
[null,"3è11",null,null,"","",null,null,""]
[null,null,null,null,"","",null,null,""]
[null,"nbre d'élèves :   ",null,null,"","",null,null,""]
[null,null,null,null,"","",null,null,""]
[null,null,null,null,"","",null,null,""]
["Classe 12","Classe","prof12",null,"","",null,null,"",{"$f":"IF(COUNTA(D71:D76)<=2,\"\",COUNTA(D71:D76))","v":""}]
[null,"3è12",null,null,"","",null,null,""]
[null,null,null,null,"","",null,null,""]
[null,"nbre d'élèves :   ",null,null,"","",null,null,""]
[null,null,null,null,"","",null,null,""]
[null,null,null,null,"","",null,null,""]
[null,null,null,null,null,null,null,null,{"$f":"IF(COUNT(I5:I76)=0,\"\",\"Attention, une ou plusieurs APSA du protocole sont mal saisies!\")","v":""},{"$f":"AVERAGE(J5:J71)","v":3}]
[null,"Date de validation par le chef d'établissement :",null,null,null,null,null,null,null,{"$f":"COUNT(J5:J71)","v":1}]
[null,"Informations à transmettre à l'inspection :"]
[]
[null,null,null,null,null,null,null,null,""]
[]
[null,"Partie reservée à l'inspection :"]

{"sheet":"9830681Y","index":5,"n_rows":83,"n_cols":10,"rows_kept":83,"cut":false,"hidden":false,"merged":[[22,0,27,0],[22,2,27,2],[2,7,3,7],[2,6,3,6],[0,3,0,5],[2,1,3,1],[2,2,3,2],[2,3,3,3],[2,4,2,5],[52,0,57,0],[52,2,57,2],[34,0,39,0],[34,2,39,2],[4,0,9,0],[4,2,9,2],[10,0,15,0],[10,2,15,2],[16,0,21,0],[16,2,21,2],[40,0,45,0],[40,2,45,2],[46,0,51,0],[46,2,51,2],[28,0,33,0],[28,2,33,2],[64,0,69,0],[64,2,69,2],[70,0,75,0],[70,2,75,2],[58,0,63,0],[58,2,63,2]]}
["R","DNB 2014","9830681Y","CLG DUMBEA SUR MER",null,null,"PROVINCE SUD","Académie de Nouvelle-Calédonie",{"$f":"IF(C1=\"\",\"\",VLOOKUP(C1,etab,4,FALSE))","v":"public"}]
["GEBEPS_2014_IPR_PROTOCOLES_public_9830681Y.xls",null,null,null,"",null,null,null,{"$f":"Données!M11","v":"V3_29/10/13"}]
[null,"CLASSES            évaluées pour le DNB","NOM \nde l'enseignant responsable de la classe","Activités","Compétences\npropres",null,"dates des évaluations","dates des rattrapages",null,"nbre APSA\n/ classe"]
[null,null,null,null,"CP","Liste"]
["Classe 1","Classe","SALEMA","Volley","CP4","N","2014-04-28","2014-05-05",{"$f":"IF(ISERROR(E5),1,\"\")","v":""},{"$f":"IF(COUNTA(D5:D10)<=2,\"\",COUNTA(D5:D10))","v":3}]
[null,"3è1",null,"Demi-fond","CP1","N","2014-07-21","2014-07-28",{"$f":"IF(ISERROR(E6),1,\"\")","v":""}]
[null,null,null,"Acrosport","CP3","N","2014-10-27","2014-11-03",""]
[null,"nbre d'élèves :   ",null,null,"","",null,null,""]
[null,27,null,null,"","",null,null,""]
[null,null,null,null,"","",null,null,""]
["Classe 2","Classe","SALEMA","Volley","CP4","N","2014-04-04","2014-04-25","",{"$f":"IF(COUNTA(D11:D16)<=2,\"\",COUNTA(D11:D16))","v":3}]
[null,"3è2",null,"Demi-fond","CP1","N","2014-07-25","2014-08-01",""]
[null,null,null,"Acrosport","CP3","N","2014-10-31","2014-11-07",""]
[null,"nbre d'élèves :   ",null,null,"","",null,null,""]
[null,29,null,null,"","",null,null,""]
[null,null,null,null,"","",null,null,""]
["Classe 3","Classe","prof3",null,"","",null,null,"",{"$f":"IF(COUNTA(D17:D22)<=2,\"\",COUNTA(D17:D22))","v":""}]
[null,"3è3",null,null,"","",null,null,""]
[null,null,null,null,"","",null,null,""]
[null,"nbre d'élèves :   ",null,null,"","",null,null,""]
[null,null,null,null,"","",null,null,""]
[null,null,null,null,"","",null,null,""]
["Classe 4","Classe","prof4",null,"","",null,null,"",{"$f":"IF(COUNTA(D23:D28)<=2,\"\",COUNTA(D23:D28))","v":""}]
[null,"3è4",null,null,"","",null,null,""]
[null,null,null,null,"","",null,null,""]
[null,"nbre d'élèves :   ",null,null,"","",null,null,""]
[null,null,null,null,"","",null,null,""]
[null,null,null,null,"","",null,null,""]
["Classe 5","Classe","prof5",null,"","",null,null,"",{"$f":"IF(COUNTA(D29:D34)<=2,\"\",COUNTA(D29:D34))","v":""}]
[null,"3è5",null,null,"","",null,null,""]
[null,null,null,null,"","",null,null,""]
[null,"nbre d'élèves :   ",null,null,"","",null,null,""]
[null,null,null,null,"","",null,null,""]
[null,null,null,null,"","",null,null,""]
["Classe 6","Classe","prof6",null,"","",null,null,"",{"$f":"IF(COUNTA(D35:D40)<=2,\"\",COUNTA(D35:D40))","v":""}]
[null,"3è6",null,null,"","",null,null,""]
[null,null,null,null,"","",null,null,""]
[null,"nbre d'élèves :   ",null,null,"","",null,null,""]
[null,null,null,null,"","",null,null,""]
[null,null,null,null,"","",null,null,""]
["Classe 7","Classe","prof7",null,"","",null,null,{"$f":"IF(ISERROR(E41),1,\"\")","v":""},{"$f":"IF(COUNTA(D41:D46)<=2,\"\",COUNTA(D41:D46))","v":""}]
[null,"3è7",null,null,"","",null,null,{"$f":"IF(ISERROR(E42),1,\"\")","v":""}]
[null,null,null,null,"","",null,null,""]
[null,"nbre d'élèves :   ",null,null,"","",null,null,""]
[null,null,null,null,"","",null,null,""]
[null,null,null,null,"","",null,null,""]
["Classe 8","Classe","prof8",null,"","",null,null,"",{"$f":"IF(COUNTA(D47:D52)<=2,\"\",COUNTA(D47:D52))","v":""}]
[null,"3è8",null,null,"","",null,null,""]
[null,null,null,null,"","",null,null,""]
[null,"nbre d'élèves :   ",null,null,"","",null,null,""]
[null,null,null,null,"","",null,null,""]
[null,null,null,null,"","",null,null,""]
["Classe 9","Classe","prof9",null,"","",null,null,"",{"$f":"IF(COUNTA(D53:D58)<=2,\"\",COUNTA(D53:D58))","v":""}]
[null,"3è9",null,null,"","",null,null,""]
[null,null,null,null,"","",null,null,""]
[null,"nbre d'élèves :   ",null,null,"","",null,null,""]
[null,null,null,null,"","",null,null,""]
[null,null,null,null,"","",null,null,""]
["Classe 10","Classe","prof10",null,"","",null,null,"",{"$f":"IF(COUNTA(D59:D64)<=2,\"\",COUNTA(D59:D64))","v":""}]
[null,"3è10",null,null,"","",null,null,""]
[null,null,null,null,"","",null,null,""]
[null,"nbre d'élèves :   ",null,null,"","",null,null,""]
[null,null,null,null,"","",null,null,""]
[null,null,null,null,"","",null,null,""]
["Classe 11","Classe","prof11",null,"","",null,null,"",{"$f":"IF(COUNTA(D65:D70)<=2,\"\",COUNTA(D65:D70))","v":""}]
[null,"3è11",null,null,"","",null,null,""]
[null,null,null,null,"","",null,null,""]
[null,"nbre d'élèves :   ",null,null,"","",null,null,""]
[null,null,null,null,"","",null,null,""]
[null,null,null,null,"","",null,null,""]
["Classe 12","Classe","prof12",null,"","",null,null,"",{"$f":"IF(COUNTA(D71:D76)<=2,\"\",COUNTA(D71:D76))","v":""}]
[null,"3è12",null,null,"","",null,null,""]
[null,null,null,null,"","",null,null,""]
[null,"nbre d'élèves :   ",null,null,"","",null,null,""]
[null,null,null,null,"","",null,null,""]
[null,null,null,null,"","",null,null,""]
[null,null,null,null,null,null,null,null,{"$f":"IF(COUNT(I5:I76)=0,\"\",\"Attention, une ou plusieurs APSA du protocole sont mal saisies!\")","v":""},{"$f":"AVERAGE(J5:J71)","v":3}]
[null,"Date de validation par le chef d'établissement :",null,null,null,null,null,null,null,{"$f":"COUNT(J5:J71)","v":2}]
[null,"Informations à transmettre à l'inspection :"]
[]
[null,null,null,null,null,null,null,null,""]
[]
[null,"Partie reservée à l'inspection :"]

{"sheet":"9830656w","index":6,"n_rows":83,"n_cols":10,"rows_kept":83,"cut":false,"hidden":false,"merged":[[0,3,0,5],[2,1,3,1],[2,2,3,2],[2,3,3,3],[2,4,2,5],[2,7,3,7],[4,0,9,0],[4,2,9,2],[10,0,15,0],[10,2,15,2],[16,0,21,0],[16,2,21,2],[2,6,3,6],[58,0,63,0],[58,2,63,2],[22,0,27,0],[22,2,27,2],[28,0,33,0],[28,2,33,2],[34,0,39,0],[34,2,39,2],[64,0,69,0],[64,2,69,2],[70,0,75,0],[70,2,75,2],[40,0,45,0],[40,2,45,2],[46,0,51,0],[46,2,51,2],[52,0,57,0],[52,2,57,2]]}
["R","DNB 2014","9830656w","CLG DE PAITA NORD - PAITA",null,null,"PROVINCE SUD","Académie de Nouvelle-Calédonie",{"$f":"IF(C1=\"\",\"\",VLOOKUP(C1,etab,4,FALSE))","v":"public"}]
["GEBEPS_2014_IPR_PROTOCOLES_public_9830656w.xls",null,null,null,"",null,null,null,{"$f":"Données!M11","v":"V3_29/10/13"}]
[null,"CLASSES            évaluées pour le DNB","NOM \nde l'enseignant responsable de la classe","Activités","Compétences\npropres",null,"dates des évaluations","dates des rattrapages",null,"nbre APSA\n/ classe"]
[null,null,null,null,"CP","Liste"]
["Classe 1","Classe","Beaumont","Demi-fond","CP1","N","2014-05-06","2014-11-07",{"$f":"IF(ISERROR(E5),1,\"\")","v":""},{"$f":"IF(COUNTA(D5:D10)<=2,\"\",COUNTA(D5:D10))","v":3}]
[null,"3ème Rouge",null,"Badminton","CP4","N","2014-07-29","2014-11-07",{"$f":"IF(ISERROR(E6),1,\"\")","v":""}]
[null,null,null,"Acrosport","CP3","N","2014-11-04","2014-11-07",""]
[null,"nbre d'élèves :   ",null,null,"","",null,null,""]
[null,null,null,null,"","",null,null,""]
[null,null,null,null,"","",null,null,""]
["Classe 2","Classe","Donguy","Demi-fond","CP1","N","2014-05-05","2014-11-07","",{"$f":"IF(COUNTA(D11:D16)<=2,\"\",COUNTA(D11:D16))","v":3}]
[null,"3ème Bleue",null,"Badminton","CP4","N","2014-10-31","2014-11-07",""]
[null,null,null,"Acrosport","CP3","N","2014-07-28","2014-11-07",""]
[null,"nbre d'élèves :   ",null,null,"","",null,null,""]
[null,null,null,null,"","",null,null,""]
[null,null,null,null,"","",null,null,""]
["Classe 3","Classe","Donguy","Demi-fond","CP1","N","2014-07-28","2014-11-07","",{"$f":"IF(COUNTA(D17:D22)<=2,\"\",COUNTA(D17:D22))","v":3}]
[null,"3ème DP6",null,"Badminton","CP4","N","2014-07-29","2014-11-07",""]
[null,null,null,"Acrosport","CP3","N","2014-11-04","2014-11-07",""]
[null,"nbre d'élèves :   ",null,null,"","",null,null,""]
[null,null,null,null,"","",null,null,""]
[null,null,null,null,"","",null,null,""]
["Classe 4","Classe","Hatterer","Demi-fond","CP1","N","2014-04-25","2014-11-07","",{"$f":"IF(COUNTA(D23:D28)<=2,\"\",COUNTA(D23:D28))","v":3}]
[null,"3ème Jaune",null,"Badminton","CP4","N","2014-08-01","2014-11-07",""]
[null,null,null,"Acrosport","CP3","N","2014-11-07","2014-11-07",""]
[null,"nbre d'élèves :   ",null,null,"","",null,null,""]
[null,null,null,null,"","",null,null,""]
[null,null,null,null,"","",null,null,""]
["Classe 5","Classe","prof5",null,"","",null,null,"",{"$f":"IF(COUNTA(D29:D34)<=2,\"\",COUNTA(D29:D34))","v":""}]
[null,null,null,null,"","",null,null,""]
[null,null,null,null,"","",null,null,""]
[null,"nbre d'élèves :   ",null,null,"","",null,null,""]
[null,null,null,null,"","",null,null,""]
[null,null,null,null,"","",null,null,""]
["Classe 6","Classe","prof6",null,"","",null,null,"",{"$f":"IF(COUNTA(D35:D40)<=2,\"\",COUNTA(D35:D40))","v":""}]
[null,"3è6",null,null,"","",null,null,""]
[null,null,null,null,"","",null,null,""]
[null,"nbre d'élèves :   ",null,null,"","",null,null,""]
[null,null,null,null,"","",null,null,""]
[null,null,null,null,"","",null,null,""]
["Classe 7","Classe","prof7",null,"","",null,null,{"$f":"IF(ISERROR(E41),1,\"\")","v":""},{"$f":"IF(COUNTA(D41:D46)<=2,\"\",COUNTA(D41:D46))","v":""}]
[null,"3è7",null,null,"","",null,null,{"$f":"IF(ISERROR(E42),1,\"\")","v":""}]
[null,null,null,null,"","",null,null,""]
[null,"nbre d'élèves :   ",null,null,"","",null,null,""]
[null,null,null,null,"","",null,null,""]
[null,null,null,null,"","",null,null,""]
["Classe 8","Classe","prof8",null,"","",null,null,"",{"$f":"IF(COUNTA(D47:D52)<=2,\"\",COUNTA(D47:D52))","v":""}]
[null,"3è8",null,null,"","",null,null,""]
[null,null,null,null,"","",null,null,""]
[null,"nbre d'élèves :   ",null,null,"","",null,null,""]
[null,null,null,null,"","",null,null,""]
[null,null,null,null,"","",null,null,""]
["Classe 9","Classe","prof9",null,"","",null,null,"",{"$f":"IF(COUNTA(D53:D58)<=2,\"\",COUNTA(D53:D58))","v":""}]
[null,"3è9",null,null,"","",null,null,""]
[null,null,null,null,"","",null,null,""]
[null,"nbre d'élèves :   ",null,null,"","",null,null,""]
[null,null,null,null,"","",null,null,""]
[null,null,null,null,"","",null,null,""]
["Classe 10","Classe","prof10",null,"","",null,null,"",{"$f":"IF(COUNTA(D59:D64)<=2,\"\",COUNTA(D59:D64))","v":""}]
[null,"3è10",null,null,"","",null,null,""]
[null,null,null,null,"","",null,null,""]
[null,"nbre d'élèves :   ",null,null,"","",null,null,""]
[null,null,null,null,"","",null,null,""]
[null,null,null,null,"","",null,null,""]
["Classe 11","Classe","prof11",null,"","",null,null,"",{"$f":"IF(COUNTA(D65:D70)<=2,\"\",COUNTA(D65:D70))","v":""}]
[null,"3è11",null,null,"","",null,null,""]
[null,null,null,null,"","",null,null,""]
[null,"nbre d'élèves :   ",null,null,"","",null,null,""]
[null,null,null,null,"","",null,null,""]
[null,null,null,null,"","",null,null,""]
["Classe 12","Classe","prof12",null,"","",null,null,"",{"$f":"IF(COUNTA(D71:D76)<=2,\"\",COUNTA(D71:D76))","v":""}]
[null,"3è12",null,null,"","",null,null,""]
[null,null,null,null,"","",null,null,""]
[null,"nbre d'élèves :   ",null,null,"","",null,null,""]
[null,null,null,null,"","",null,null,""]
[null,null,null,null,"","",null,null,""]
[null,null,null,null,null,null,null,null,{"$f":"IF(COUNT(I5:I76)=0,\"\",\"Attention, une ou plusieurs APSA du protocole sont mal saisies!\")","v":""},{"$f":"AVERAGE(J5:J71)","v":3}]
[null,"Date de validation par le chef d'établissement :",null,null,null,null,null,null,null,{"$f":"COUNT(J5:J71)","v":4}]
[null,"Informations à transmettre à l'inspection :"]
[]
[null,null,null,null,null,null,null,null,""]
[]
[null,"Partie reservée à l'inspection :"]

{"sheet":"9830649N","index":7,"n_rows":83,"n_cols":10,"rows_kept":83,"cut":false,"hidden":false,"merged":[[0,3,0,5],[2,1,3,1],[2,2,3,2],[2,3,3,3],[2,4,2,5],[2,7,3,7],[4,0,9,0],[4,2,9,2],[10,0,15,0],[10,2,15,2],[16,0,21,0],[16,2,21,2],[2,6,3,6],[58,0,63,0],[58,2,63,2],[22,0,27,0],[22,2,27,2],[28,0,33,0],[28,2,33,2],[34,0,39,0],[34,2,39,2],[64,0,69,0],[64,2,69,2],[70,0,75,0],[70,2,75,2],[40,0,45,0],[40,2,45,2],[46,0,51,0],[46,2,51,2],[52,0,57,0],[52,2,57,2]]}
["R","DNB 2014","9830649N","CLG ALAIN MERMOUD TUBAND - NOUMEA",null,null,"PROVINCE SUD","Académie de Nouvelle-Calédonie",{"$f":"IF(C1=\"\",\"\",VLOOKUP(C1,etab,4,FALSE))","v":"public"}]
["GEBEPS_2014_IPR_PROTOCOLES_public_9830649N.xls",null,null,null,"",null,null,null,{"$f":"Données!M11","v":"V3_29/10/13"}]
[null,"CLASSES            évaluées pour le DNB","NOM \nde l'enseignant responsable de la classe","Activités","Compétences\npropres",null,"dates des évaluations","dates des rattrapages",null,"nbre APSA\n/ classe"]
[null,null,null,null,"CP","Liste"]
["Classe 1","Classe","OBLET","Planche à voile","CP2","A","2014-04-28","2014-05-05",{"$f":"IF(ISERROR(E5),1,\"\")","v":""},{"$f":"IF(COUNTA(D5:D10)<=2,\"\",COUNTA(D5:D10))","v":3}]
[null,301,null,"Acrosport","CP3","N","2014-11-03","2014-11-07",{"$f":"IF(ISERROR(E6),1,\"\")","v":""}]
[null,null,null,"Tennis de table","CP4","N","2014-07-28","2014-08-01",""]
[null,"nbre d'élèves :   ",null,null,"","",null,null,""]
[null,28,null,null,"","",null,null,""]
[null,null,null,null,"","",null,null,""]
["Classe 2","Classe","CHANTREUX","Acrosport","CP3","N","2014-04-24","2014-05-05","",{"$f":"IF(COUNTA(D11:D16)<=2,\"\",COUNTA(D11:D16))","v":3}]
[null,302,null,"Tennis de table","CP4","N","2014-07-24","2014-07-31",""]
[null,null,null,"Relais-vitesse","CP1","N","2014-10-02","2014-10-09",""]
[null,"nbre d'élèves :   ",null,null,"","",null,null,""]
[null,28,null,null,"","",null,null,""]
[null,null,null,null,"","",null,null,""]
["Classe 3","Classe","OBLET","Relais-vitesse","CP1","N","2014-04-25","2014-04-28","",{"$f":"IF(COUNTA(D17:D22)<=2,\"\",COUNTA(D17:D22))","v":3}]
[null,303,null,"Acrosport","CP3","N","2014-11-03","2014-11-07",""]
[null,null,null,"Tennis de table","CP4","N","2014-07-28","2014-08-01",""]
[null,"nbre d'élèves :   ",null,null,"","",null,null,""]
[null,28,null,null,"","",null,null,""]
[null,null,null,null,"","",null,null,""]
["Classe 4","Classe","OBLET","Planche à voile","CP2","A","2014-05-29","2014-05-06","",{"$f":"IF(COUNTA(D23:D28)<=2,\"\",COUNTA(D23:D28))","v":3}]
[null,304,null,"Acrosport","CP3","N","2014-10-31","2014-11-04",""]
[null,null,null,"Tennis de table","CP4","N","2014-07-25","2014-07-29",""]
[null,"nbre d'élèves :   ",null,null,"","",null,null,""]
[null,27,null,null,"","",null,null,""]
[null,null,null,null,"","",null,null,""]
["Classe 5","Classe","CHANTREUX","Acrosport","CP3","N","2014-04-23","2014-04-30","",{"$f":"IF(COUNTA(D29:D34)<=2,\"\",COUNTA(D29:D34))","v":3}]
[null,305,null,"Tennis de table","CP4","N","2014-07-23","2014-07-30",""]
[null,null,null,"Relais-vitesse","CP1","N","2014-10-01","2014-10-08",""]
[null,"nbre d'élèves :   ",null,null,"","",null,null,""]
[null,28,null,null,"","",null,null,""]
[null,null,null,null,"","",null,null,""]
["Classe 6","Classe","prof6",null,"","",null,null,"",{"$f":"IF(COUNTA(D35:D40)<=2,\"\",COUNTA(D35:D40))","v":""}]
[null,"3è6",null,null,"","",null,null,""]
[null,null,null,null,"","",null,null,""]
[null,"nbre d'élèves :   ",null,null,"","",null,null,""]
[null,null,null,null,"","",null,null,""]
[null,null,null,null,"","",null,null,""]
["Classe 7","Classe","prof7",null,"","",null,null,{"$f":"IF(ISERROR(E41),1,\"\")","v":""},{"$f":"IF(COUNTA(D41:D46)<=2,\"\",COUNTA(D41:D46))","v":""}]
[null,"3è7",null,null,"","",null,null,{"$f":"IF(ISERROR(E42),1,\"\")","v":""}]
[null,null,null,null,"","",null,null,""]
[null,"nbre d'élèves :   ",null,null,"","",null,null,""]
[null,null,null,null,"","",null,null,""]
[null,null,null,null,"","",null,null,""]
["Classe 8","Classe","prof8",null,"","",null,null,"",{"$f":"IF(COUNTA(D47:D52)<=2,\"\",COUNTA(D47:D52))","v":""}]
[null,"3è8",null,null,"","",null,null,""]
[null,null,null,null,"","",null,null,""]
[null,"nbre d'élèves :   ",null,null,"","",null,null,""]
[null,null,null,null,"","",null,null,""]
[null,null,null,null,"","",null,null,""]
["Classe 9","Classe","prof9",null,"","",null,null,"",{"$f":"IF(COUNTA(D53:D58)<=2,\"\",COUNTA(D53:D58))","v":""}]
[null,"3è9",null,null,"","",null,null,""]
[null,null,null,null,"","",null,null,""]
[null,"nbre d'élèves :   ",null,null,"","",null,null,""]
[null,null,null,null,"","",null,null,""]
[null,null,null,null,"","",null,null,""]
["Classe 10","Classe","prof10",null,"","",null,null,"",{"$f":"IF(COUNTA(D59:D64)<=2,\"\",COUNTA(D59:D64))","v":""}]
[null,"3è10",null,null,"","",null,null,""]
[null,null,null,null,"","",null,null,""]
[null,"nbre d'élèves :   ",null,null,"","",null,null,""]
[null,null,null,null,"","",null,null,""]
[null,null,null,null,"","",null,null,""]
["Classe 11","Classe","prof11",null,"","",null,null,"",{"$f":"IF(COUNTA(D65:D70)<=2,\"\",COUNTA(D65:D70))","v":""}]
[null,"3è11",null,null,"","",null,null,""]
[null,null,null,null,"","",null,null,""]
[null,"nbre d'élèves :   ",null,null,"","",null,null,""]
[null,null,null,null,"","",null,null,""]
[null,null,null,null,"","",null,null,""]
["Classe 12","Classe","prof12",null,"","",null,null,"",{"$f":"IF(COUNTA(D71:D76)<=2,\"\",COUNTA(D71:D76))","v":""}]
[null,"3è12",null,null,"","",null,null,""]
[null,null,null,null,"","",null,null,""]
[null,"nbre d'élèves :   ",null,null,"","",null,null,""]
[null,null,null,null,"","",null,null,""]
[null,null,null,null,"","",null,null,""]
[null,null,null,null,null,null,null,null,{"$f":"IF(COUNT(I5:I76)=0,\"\",\"Attention, une ou plusieurs APSA du protocole sont mal saisies!\")","v":""},{"$f":"AVERAGE(J5:J71)","v":3}]
[null,"Date de validation par le chef d'établissement :",null,null,null,null,null,null,null,{"$f":"COUNT(J5:J71)","v":5}]
[null,"Informations à transmettre à l'inspection :"]
[]
[null,null,null,null,null,null,null,null,""]
[]
[null,"Partie reservée à l'inspection :"]

{"sheet":"9830640D","index":8,"n_rows":83,"n_cols":10,"rows_kept":83,"cut":false,"hidden":false,"merged":[[22,0,27,0],[22,2,27,2],[2,7,3,7],[2,6,3,6],[0,3,0,5],[2,1,3,1],[2,2,3,2],[2,3,3,3],[2,4,2,5],[52,0,57,0],[52,2,57,2],[34,0,39,0],[34,2,39,2],[4,0,9,0],[4,2,9,2],[10,0,15,0],[10,2,15,2],[16,0,21,0],[16,2,21,2],[40,0,45,0],[40,2,45,2],[46,0,51,0],[46,2,51,2],[28,0,33,0],[28,2,33,2],[64,0,69,0],[64,2,69,2],[70,0,75,0],[70,2,75,2],[58,0,63,0],[58,2,63,2]]}
["R","DNB 2014","9830640D","CLG EDMEE VARIN AUTEUIL ET SEGPA - NOUMEA",null,null,"PROVINCE SUD","Académie de Nouvelle-Calédonie",{"$f":"IF(C1=\"\",\"\",VLOOKUP(C1,etab,4,FALSE))","v":"public"}]
["GEBEPS_2014_IPR_PROTOCOLES_public_9830640D.xls",null,null,null,"",null,null,null,{"$f":"Données!M11","v":"V3_29/10/13"}]
[null,"CLASSES            évaluées pour le DNB","NOM \nde l'enseignant responsable de la classe","Activités","Compétences\npropres",null,"dates des évaluations","dates des rattrapages",null,"nbre APSA\n/ classe"]
[null,null,null,null,"CP","Liste"]
["Classe 1","Classe","DEVILLERS","Demi-fond","CP1","N","2014-05-19","2014-05-26",{"$f":"IF(ISERROR(E5),1,\"\")","v":""},{"$f":"IF(COUNTA(D5:D10)<=2,\"\",COUNTA(D5:D10))","v":3}]
[null,"3è1",null,"Acrosport","CP3","N","2014-04-03","2014-04-24",{"$f":"IF(ISERROR(E6),1,\"\")","v":""}]
[null,null,null,"Basket","CP4","N","2014-08-07","2014-08-28",""]
[null,"nbre d'élèves :   ",null,null,"","",null,null,""]
[null,27,null,null,"","",null,null,""]
[null,null,null,null,"","",null,null,""]
["Classe 2","Classe","ROBIN","Demi-fond","CP1","N","2014-08-04","2014-08-25","",{"$f":"IF(COUNTA(D11:D16)<=2,\"\",COUNTA(D11:D16))","v":3}]
[null,"3è2",null,"Acrosport","CP3","N","2014-10-31","2014-11-07",""]
[null,null,null,"Basket","CP4","N","2014-04-04","2014-04-25",""]
[null,"nbre d'élèves :   ",null,null,"","",null,null,""]
[null,27,null,null,"","",null,null,""]
[null,null,null,null,"","",null,null,""]
["Classe 3","Classe","DEVILLERS","Demi-fond","CP1","N","2014-05-19","2014-05-26","",{"$f":"IF(COUNTA(D17:D22)<=2,\"\",COUNTA(D17:D22))","v":3}]
[null,"3è3",null,"Acrosport","CP3","N","2014-10-31","2014-11-07",""]
[null,null,null,"Basket","CP4","N","2014-04-03","2014-04-24",""]
[null,"nbre d'élèves :   ",null,null,"","",null,null,""]
[null,27,null,null,"","",null,null,""]
[null,null,null,null,"","",null,null,""]
["Classe 4","Classe","BEAUDOIN-LAFON/ HAMMOUMRAOUI","Demi-fond","CP1","N","2014-07-25","2014-08-01","",{"$f":"IF(COUNTA(D23:D28)<=2,\"\",COUNTA(D23:D28))","v":3}]
[null,"3è4",null,"Acrosport","CP3","N","2014-10-29","2014-11-05",""]
[null,null,null,"Basket","CP4","N","2014-07-23","2014-07-30",""]
[null,"nbre d'élèves :   ",null,null,"","",null,null,""]
[null,28,null,null,"","",null,null,""]
[null,null,null,null,"","",null,null,""]
["Classe 5","Classe","GODOT","Demi-fond","CP1","N","2014-07-22","2014-07-29","",{"$f":"IF(COUNTA(D29:D34)<=2,\"\",COUNTA(D29:D34))","v":3}]
[null,"3è5",null,"Acrosport","CP3","N","2014-04-03","2014-04-24",""]
[null,null,null,"Basket","CP4","N","2014-07-24","2014-07-31",""]
[null,"nbre d'élèves :   ",null,null,"","",null,null,""]
[null,27,null,null,"","",null,null,""]
[null,null,null,null,"","",null,null,""]
["Classe 6","Classe","HAMMOUMRAOUI","Demi-fond","CP1","N","2014-07-31","2014-08-28","",{"$f":"IF(COUNTA(D35:D40)<=2,\"\",COUNTA(D35:D40))","v":3}]
[null,"3è6",null,"Acrosport","CP3","N","2014-10-31","2014-11-07",""]
[null,null,null,"Basket","CP4","N","2014-07-25","2014-08-01",""]
[null,"nbre d'élèves :   ",null,null,"","",null,null,""]
[null,20,null,null,"","",null,null,""]
[null,null,null,null,"","",null,null,""]
["Classe 7","Classe","prof7",null,"","",null,null,{"$f":"IF(ISERROR(E41),1,\"\")","v":""},{"$f":"IF(COUNTA(D41:D46)<=2,\"\",COUNTA(D41:D46))","v":""}]
[null,"3è7",null,null,"","",null,null,{"$f":"IF(ISERROR(E42),1,\"\")","v":""}]
[null,null,null,null,"","",null,null,""]
[null,"nbre d'élèves :   ",null,null,"","",null,null,""]
[null,null,null,null,"","",null,null,""]
[null,null,null,null,"","",null,null,""]
["Classe 8","Classe","prof8",null,"","",null,null,"",{"$f":"IF(COUNTA(D47:D52)<=2,\"\",COUNTA(D47:D52))","v":""}]
[null,"3è8",null,null,"","",null,null,""]
[null,null,null,null,"","",null,null,""]
[null,"nbre d'élèves :   ",null,null,"","",null,null,""]
[null,null,null,null,"","",null,null,""]
[null,null,null,null,"","",null,null,""]
["Classe 9","Classe","prof9",null,"","",null,null,"",{"$f":"IF(COUNTA(D53:D58)<=2,\"\",COUNTA(D53:D58))","v":""}]
[null,"3è9",null,null,"","",null,null,""]
[null,null,null,null,"","",null,null,""]
[null,"nbre d'élèves :   ",null,null,"","",null,null,""]
[null,null,null,null,"","",null,null,""]
[null,null,null,null,"","",null,null,""]
["Classe 10","Classe","prof10",null,"","",null,null,"",{"$f":"IF(COUNTA(D59:D64)<=2,\"\",COUNTA(D59:D64))","v":""}]
[null,"3è10",null,null,"","",null,null,""]
[null,null,null,null,"","",null,null,""]
[null,"nbre d'élèves :   ",null,null,"","",null,null,""]
[null,null,null,null,"","",null,null,""]
[null,null,null,null,"","",null,null,""]
["Classe 11","Classe","prof11",null,"","",null,null,"",{"$f":"IF(COUNTA(D65:D70)<=2,\"\",COUNTA(D65:D70))","v":""}]
[null,"3è11",null,null,"","",null,null,""]
[null,null,null,null,"","",null,null,""]
[null,"nbre d'élèves :   ",null,null,"","",null,null,""]
[null,null,null,null,"","",null,null,""]
[null,null,null,null,"","",null,null,""]
["Classe 12","Classe","prof12",null,"","",null,null,"",{"$f":"IF(COUNTA(D71:D76)<=2,\"\",COUNTA(D71:D76))","v":""}]
[null,"3è12",null,null,"","",null,null,""]
[null,null,null,null,"","",null,null,""]
[null,"nbre d'élèves :   ",null,null,"","",null,null,""]
[null,null,null,null,"","",null,null,""]
[null,null,null,null,"","",null,null,""]
[null,null,null,null,null,null,null,null,{"$f":"IF(COUNT(I5:I76)=0,\"\",\"Attention, une ou plusieurs APSA du protocole sont mal saisies!\")","v":""},{"$f":"AVERAGE(J5:J71)","v":3}]
[null,"Date de validation par le chef d'établissement :",null,null,null,null,null,null,null,{"$f":"COUNT(J5:J71)","v":6}]
[null,"Informations à transmettre à l'inspection :"]
[]
[null,null,null,null,null,null,null,null,""]
[]
[null,"Partie reservée à l'inspection :"]

{"sheet":"9830639C","index":9,"n_rows":83,"n_cols":10,"rows_kept":83,"cut":false,"hidden":false,"merged":[[0,3,0,5],[2,1,3,1],[2,2,3,2],[2,3,3,3],[2,4,2,5],[2,7,3,7],[4,0,9,0],[4,2,9,2],[10,0,15,0],[10,2,15,2],[16,0,21,0],[16,2,21,2],[2,6,3,6],[58,0,63,0],[58,2,63,2],[22,0,27,0],[22,2,27,2],[28,0,33,0],[28,2,33,2],[34,0,39,0],[34,2,39,2],[64,0,69,0],[64,2,69,2],[70,0,75,0],[70,2,75,2],[40,0,45,0],[40,2,45,2],[46,0,51,0],[46,2,51,2],[52,0,57,0],[52,2,57,2]]}
["R","DNB 2014","9830639C","CLG OUVEA ET SEGPA",null,null,"PROVINCE DES ILES","Académie de Nouvelle-Calédonie",{"$f":"IF(C1=\"\",\"\",VLOOKUP(C1,etab,4,FALSE))","v":"public"}]
["GEBEPS_2014_IPR_PROTOCOLES_public_9830639C.xls",null,null,null,"",null,null,null,{"$f":"Données!M11","v":"V3_29/10/13"}]
[null,"CLASSES            évaluées pour le DNB","NOM \nde l'enseignant responsable de la classe","Activités","Compétences\npropres",null,"dates des évaluations","dates des rattrapages",null,"nbre APSA\n/ classe"]
[null,null,null,null,"CP","Liste"]
["Classe 1","Classe","VINCENT-VIRY","Planche à voile","CP2","A","2014-04-30","2014-05-07",{"$f":"IF(ISERROR(E5),1,\"\")","v":""},{"$f":"IF(COUNTA(D5:D10)<=2,\"\",COUNTA(D5:D10))","v":3}]
[null,"3è1",null,"Volley","CP4","N","2014-07-23","2014-07-30",{"$f":"IF(ISERROR(E6),1,\"\")","v":""}]
[null,"générale",null,"Javelot","CP1","N","2014-10-29","2014-11-05",""]
[null,"nbre d'élèves :   ",null,null,"","",null,null,""]
[null,10,null,null,"","",null,null,""]
[null,null,null,null,"","",null,null,""]
["Classe 2","Classe","VINCENT-VIRY","Voile","CP2","A","2014-04-30","2014-05-07","",{"$f":"IF(COUNTA(D11:D16)<=2,\"\",COUNTA(D11:D16))","v":3}]
[null,"3è2",null,"Volley","CP4","N","2014-07-23","2014-07-30",""]
[null,"générale",null,"Javelot","CP1","N","2014-10-29","2014-11-05",""]
[null,"nbre d'élèves :   ",null,null,"","",null,null,""]
[null,11,null,null,"","",null,null,""]
[null,null,null,null,"","",null,null,""]
["Classe 3","Classe","VINCENT-VIRY","Voile","CP2","A","2014-09-25","2014-10-02","",{"$f":"IF(COUNTA(D17:D22)<=2,\"\",COUNTA(D17:D22))","v":3}]
[null,"3è3",null,"Volley","CP4","N","2014-07-10","2014-07-17",""]
[null,"PDMF",null,"Javelot","CP1","N","2014-06-26","2014-07-03",""]
[null,"nbre d'élèves :   ",null,null,"","",null,null,""]
[null,13,null,null,"","",null,null,""]
[null,null,null,null,"","",null,null,""]
["Classe 4","Classe","prof4",null,"","",null,null,"",{"$f":"IF(COUNTA(D23:D28)<=2,\"\",COUNTA(D23:D28))","v":""}]
[null,"3è4",null,null,"","",null,null,""]
[null,null,null,null,"","",null,null,""]
[null,"nbre d'élèves :   ",null,null,"","",null,null,""]
[null,null,null,null,"","",null,null,""]
[null,null,null,null,"","",null,null,""]
["Classe 5","Classe","prof5",null,"","",null,null,"",{"$f":"IF(COUNTA(D29:D34)<=2,\"\",COUNTA(D29:D34))","v":""}]
[null,"3è5",null,null,"","",null,null,""]
[null,null,null,null,"","",null,null,""]
[null,"nbre d'élèves :   ",null,null,"","",null,null,""]
[null,null,null,null,"","",null,null,""]
[null,null,null,null,"","",null,null,""]
["Classe 6","Classe","prof6",null,"","",null,null,"",{"$f":"IF(COUNTA(D35:D40)<=2,\"\",COUNTA(D35:D40))","v":""}]
[null,"3è6",null,null,"","",null,null,""]
[null,null,null,null,"","",null,null,""]
[null,"nbre d'élèves :   ",null,null,"","",null,null,""]
[null,null,null,null,"","",null,null,""]
[null,null,null,null,"","",null,null,""]
["Classe 7","Classe","prof7",null,"","",null,null,{"$f":"IF(ISERROR(E41),1,\"\")","v":""},{"$f":"IF(COUNTA(D41:D46)<=2,\"\",COUNTA(D41:D46))","v":""}]
[null,"3è7",null,null,"","",null,null,{"$f":"IF(ISERROR(E42),1,\"\")","v":""}]
[null,null,null,null,"","",null,null,""]
[null,"nbre d'élèves :   ",null,null,"","",null,null,""]
[null,null,null,null,"","",null,null,""]
[null,null,null,null,"","",null,null,""]
["Classe 8","Classe","prof8",null,"","",null,null,"",{"$f":"IF(COUNTA(D47:D52)<=2,\"\",COUNTA(D47:D52))","v":""}]
[null,"3è8",null,null,"","",null,null,""]
[null,null,null,null,"","",null,null,""]
[null,"nbre d'élèves :   ",null,null,"","",null,null,""]
[null,null,null,null,"","",null,null,""]
[null,null,null,null,"","",null,null,""]
["Classe 9","Classe","prof9",null,"","",null,null,"",{"$f":"IF(COUNTA(D53:D58)<=2,\"\",COUNTA(D53:D58))","v":""}]
[null,"3è9",null,null,"","",null,null,""]
[null,null,null,null,"","",null,null,""]
[null,"nbre d'élèves :   ",null,null,"","",null,null,""]
[null,null,null,null,"","",null,null,""]
[null,null,null,null,"","",null,null,""]
["Classe 10","Classe","prof10",null,"","",null,null,"",{"$f":"IF(COUNTA(D59:D64)<=2,\"\",COUNTA(D59:D64))","v":""}]
[null,"3è10",null,null,"","",null,null,""]
[null,null,null,null,"","",null,null,""]
[null,"nbre d'élèves :   ",null,null,"","",null,null,""]
[null,null,null,null,"","",null,null,""]
[null,null,null,null,"","",null,null,""]
["Classe 11","Classe","prof11",null,"","",null,null,"",{"$f":"IF(COUNTA(D65:D70)<=2,\"\",COUNTA(D65:D70))","v":""}]
[null,"3è11",null,null,"","",null,null,""]
[null,null,null,null,"","",null,null,""]
[null,"nbre d'élèves :   ",null,null,"","",null,null,""]
[null,null,null,null,"","",null,null,""]
[null,null,null,null,"","",null,null,""]
["Classe 12","Classe","prof12",null,"","",null,null,"",{"$f":"IF(COUNTA(D71:D76)<=2,\"\",COUNTA(D71:D76))","v":""}]
[null,"3è12",null,null,"","",null,null,""]
[null,null,null,null,"","",null,null,""]
[null,"nbre d'élèves :   ",null,null,"","",null,null,""]
[null,null,null,null,"","",null,null,""]
[null,null,null,null,"","",null,null,""]
[null,null,null,null,null,null,null,null,{"$f":"IF(COUNT(I5:I76)=0,\"\",\"Attention, une ou plusieurs APSA du protocole sont mal saisies!\")","v":""},{"$f":"AVERAGE(J5:J71)","v":3}]
[null,"Date de validation par le chef d'établissement :",null,null,null,null,null,null,null,{"$f":"COUNT(J5:J71)","v":3}]
[null,"Informations à transmettre à l'inspection :"]
[]
[null,null,null,null,null,null,null,null,""]
[]
[null,"Partie reservée à l'inspection :"]

{"sheet":"9830632V","index":10,"n_rows":83,"n_cols":10,"rows_kept":83,"cut":false,"hidden":false,"merged":[[0,3,0,5],[2,1,3,1],[2,2,3,2],[2,3,3,3],[2,4,2,5],[2,7,3,7],[4,0,9,0],[4,2,9,2],[10,0,15,0],[10,2,15,2],[16,0,21,0],[16,2,21,2],[2,6,3,6],[58,0,63,0],[58,2,63,2],[22,0,27,0],[22,2,27,2],[28,0,33,0],[28,2,33,2],[34,0,39,0],[34,2,39,2],[64,0,69,0],[64,2,69,2],[70,0,75,0],[70,2,75,2],[40,0,45,0],[40,2,45,2],[46,0,51,0],[46,2,51,2],[52,0,57,0],[52,2,57,2]]}
["R","DNB 2014","9830632V","CLG DE OUEGOA",null,null,"PROVINCE NORD","Académie de Nouvelle-Calédonie",{"$f":"IF(C1=\"\",\"\",VLOOKUP(C1,etab,4,FALSE))","v":"public"}]
["GEBEPS_2014_IPR_PROTOCOLES_public_9830632V.xls",null,null,null,"",null,null,null,{"$f":"Données!M11","v":"V3_29/10/13"}]
[null,"CLASSES            évaluées pour le DNB","NOM \nde l'enseignant responsable de la classe","Activités","Compétences\npropres",null,"dates des évaluations","dates des rattrapages",null,"nbre APSA\n/ classe"]
[null,null,null,null,"CP","Liste"]
["Classe 1","Classe","SOULIER Enora","Basket","CP4","N","2014-05-12","2014-05-16",{"$f":"IF(ISERROR(E5),1,\"\")","v":""},{"$f":"IF(COUNTA(D5:D10)<=2,\"\",COUNTA(D5:D10))","v":3}]
[null,"3èA",null,"Javelot","CP1","N","2014-08-04","2014-08-08",{"$f":"IF(ISERROR(E6),1,\"\")","v":""}]
[null,null,null,"CO","CP2","N","2014-10-27","2014-11-03",""]
[null,"nbre d'élèves :   ",null,null,"","",null,null,""]
[null,17,null,null,"","",null,null,""]
[null,null,null,null,"","",null,null,""]
["Classe 2","Classe","SOULIER Enora","Basket","CP4","N","2014-05-12","2014-05-19","",{"$f":"IF(COUNTA(D11:D16)<=2,\"\",COUNTA(D11:D16))","v":3}]
[null,"3èPDMF",null,"Javelot","CP1","N","2014-08-01","2014-08-04",""]
[null,null,null,"CO","CP2","N","2014-10-27","2014-11-03",""]
[null,"nbre d'élèves :   ",null,null,"","",null,null,""]
[null,10,null,null,"","",null,null,""]
[null,null,null,null,"","",null,null,""]
["Classe 3","Classe","prof3",null,"","",null,null,"",{"$f":"IF(COUNTA(D17:D22)<=2,\"\",COUNTA(D17:D22))","v":""}]
[null,"3è3",null,null,"","",null,null,""]
[null,null,null,null,"","",null,null,""]
[null,"nbre d'élèves :   ",null,null,"","",null,null,""]
[null,null,null,null,"","",null,null,""]
[null,null,null,null,"","",null,null,""]
["Classe 4","Classe","prof4",null,"","",null,null,"",{"$f":"IF(COUNTA(D23:D28)<=2,\"\",COUNTA(D23:D28))","v":""}]
[null,"3è4",null,null,"","",null,null,""]
[null,null,null,null,"","",null,null,""]
[null,"nbre d'élèves :   ",null,null,"","",null,null,""]
[null,null,null,null,"","",null,null,""]
[null,null,null,null,"","",null,null,""]
["Classe 5","Classe","prof5",null,"","",null,null,"",{"$f":"IF(COUNTA(D29:D34)<=2,\"\",COUNTA(D29:D34))","v":""}]
[null,"3è5",null,null,"","",null,null,""]
[null,null,null,null,"","",null,null,""]
[null,"nbre d'élèves :   ",null,null,"","",null,null,""]
[null,null,null,null,"","",null,null,""]
[null,null,null,null,"","",null,null,""]
["Classe 6","Classe","prof6",null,"","",null,null,"",{"$f":"IF(COUNTA(D35:D40)<=2,\"\",COUNTA(D35:D40))","v":""}]
[null,"3è6",null,null,"","",null,null,""]
[null,null,null,null,"","",null,null,""]
[null,"nbre d'élèves :   ",null,null,"","",null,null,""]
[null,null,null,null,"","",null,null,""]
[null,null,null,null,"","",null,null,""]
["Classe 7","Classe","prof7",null,"","",null,null,{"$f":"IF(ISERROR(E41),1,\"\")","v":""},{"$f":"IF(COUNTA(D41:D46)<=2,\"\",COUNTA(D41:D46))","v":""}]
[null,"3è7",null,null,"","",null,null,{"$f":"IF(ISERROR(E42),1,\"\")","v":""}]
[null,null,null,null,"","",null,null,""]
[null,"nbre d'élèves :   ",null,null,"","",null,null,""]
[null,null,null,null,"","",null,null,""]
[null,null,null,null,"","",null,null,""]
["Classe 8","Classe","prof8",null,"","",null,null,"",{"$f":"IF(COUNTA(D47:D52)<=2,\"\",COUNTA(D47:D52))","v":""}]
[null,"3è8",null,null,"","",null,null,""]
[null,null,null,null,"","",null,null,""]
[null,"nbre d'élèves :   ",null,null,"","",null,null,""]
[null,null,null,null,"","",null,null,""]
[null,null,null,null,"","",null,null,""]
["Classe 9","Classe","prof9",null,"","",null,null,"",{"$f":"IF(COUNTA(D53:D58)<=2,\"\",COUNTA(D53:D58))","v":""}]
[null,"3è9",null,null,"","",null,null,""]
[null,null,null,null,"","",null,null,""]
[null,"nbre d'élèves :   ",null,null,"","",null,null,""]
[null,null,null,null,"","",null,null,""]
[null,null,null,null,"","",null,null,""]
["Classe 10","Classe","prof10",null,"","",null,null,"",{"$f":"IF(COUNTA(D59:D64)<=2,\"\",COUNTA(D59:D64))","v":""}]
[null,"3è10",null,null,"","",null,null,""]
[null,null,null,null,"","",null,null,""]
[null,"nbre d'élèves :   ",null,null,"","",null,null,""]
[null,null,null,null,"","",null,null,""]
[null,null,null,null,"","",null,null,""]
["Classe 11","Classe","prof11",null,"","",null,null,"",{"$f":"IF(COUNTA(D65:D70)<=2,\"\",COUNTA(D65:D70))","v":""}]
[null,"3è11",null,null,"","",null,null,""]
[null,null,null,null,"","",null,null,""]
[null,"nbre d'élèves :   ",null,null,"","",null,null,""]
[null,null,null,null,"","",null,null,""]
[null,null,null,null,"","",null,null,""]
["Classe 12","Classe","prof12",null,"","",null,null,"",{"$f":"IF(COUNTA(D71:D76)<=2,\"\",COUNTA(D71:D76))","v":""}]
[null,"3è12",null,null,"","",null,null,""]
[null,null,null,null,"","",null,null,""]
[null,"nbre d'élèves :   ",null,null,"","",null,null,""]
[null,null,null,null,"","",null,null,""]
[null,null,null,null,"","",null,null,""]
[null,null,null,null,null,null,null,null,{"$f":"IF(COUNT(I5:I76)=0,\"\",\"Attention, une ou plusieurs APSA du protocole sont mal saisies!\")","v":""},{"$f":"AVERAGE(J5:J71)","v":3}]
[null,"Date de validation par le chef d'établissement :",null,null,"2014-04-01",null,null,null,null,{"$f":"COUNT(J5:J71)","v":2}]
[null,"Informations à transmettre à l'inspection :"]
[]
[null,null,null,null,null,null,null,null,""]
[]
[null,"Partie reservée à l'inspection :"]

{"sheet":"9830626N","index":11,"n_rows":83,"n_cols":10,"rows_kept":83,"cut":false,"hidden":false,"merged":[[0,3,0,5],[2,1,3,1],[2,2,3,2],[2,3,3,3],[2,4,2,5],[2,7,3,7],[4,0,9,0],[4,2,9,2],[10,0,15,0],[10,2,15,2],[16,0,21,0],[16,2,21,2],[2,6,3,6],[58,0,63,0],[58,2,63,2],[22,0,27,0],[22,2,27,2],[28,0,33,0],[28,2,33,2],[34,0,39,0],[34,2,39,2],[64,0,69,0],[64,2,69,2],[70,0,75,0],[70,2,75,2],[40,0,45,0],[40,2,45,2],[46,0,51,0],[46,2,51,2],[52,0,57,0],[52,2,57,2]]}
["R","DNB 2014","9830626N","CLG JEAN FAYARD - KATIRAMONA",null,null,"PROVINCE SUD","Académie de Nouvelle-Calédonie",{"$f":"IF(C1=\"\",\"\",VLOOKUP(C1,etab,4,FALSE))","v":"public"}]
["GEBEPS_2014_IPR_PROTOCOLES_public_9830626N.xls",null,null,null,"",null,null,null,{"$f":"Données!M11","v":"V3_29/10/13"}]
[null,"CLASSES            évaluées pour le DNB","NOM \nde l'enseignant responsable de la classe","Activités","Compétences\npropres",null,"dates des évaluations","dates des rattrapages",null,"nbre APSA\n/ classe"]
[null,null,null,null,"CP","Liste"]
["Classe 1","Classe","DIAZ","Acrosport","CP3","N","2014-05-16","2014-10-31",{"$f":"IF(ISERROR(E5),1,\"\")","v":""},{"$f":"IF(COUNTA(D5:D10)<=2,\"\",COUNTA(D5:D10))","v":3}]
[null,"3èA",null,"Demi-fond","CP1","N","2014-07-29","2014-11-07",{"$f":"IF(ISERROR(E6),1,\"\")","v":""}]
[null,null,null,"Rugby","CP4","N","2014-11-04","2014-11-07",""]
[null,"nbre d'élèves :   ",null,null,"","",null,null,""]
[null,20,null,null,"","",null,null,""]
[null,null,null,null,"","",null,null,""]
["Classe 2","Classe","DIAZ","Acrosport","CP3","N","2014-05-07","2014-10-29","",{"$f":"IF(COUNTA(D11:D16)<=2,\"\",COUNTA(D11:D16))","v":3}]
[null,"3èB",null,"Demi-fond","CP1","N","2014-07-25","2014-11-07",""]
[null,null,null,"Rugby","CP4","N","2014-11-05","2014-11-07",""]
[null,"nbre d'élèves :   ",null,null,"","",null,null,""]
[null,18,null,null,"","",null,null,""]
[null,null,null,null,"","",null,null,""]
["Classe 3","Classe","WEIHSBACH","Acrosport","CP3","N","2014-05-05","2014-11-03","",{"$f":"IF(COUNTA(D17:D22)<=2,\"\",COUNTA(D17:D22))","v":3}]
[null,"3èC",null,"Demi-fond","CP1","N","2014-07-24","2014-11-06",""]
[null,null,null,"Rugby","CP4","N","2014-10-30","2014-11-06",""]
[null,"nbre d'élèves :   ",null,null,"","",null,null,""]
[null,23,null,null,"","",null,null,""]
[null,null,null,null,"","",null,null,""]
["Classe 4","Classe","WEIHSBACH","Acrosport","CP3","N","2014-07-30","2014-11-03","",{"$f":"IF(COUNTA(D23:D28)<=2,\"\",COUNTA(D23:D28))","v":3}]
[null,"3èD",null,"Demi-fond","CP1","N","2014-07-28","2014-11-05",""]
[null,null,null,"Rugby","CP4","N","2014-10-29","2014-11-05",""]
[null,"nbre d'élèves :   ",null,null,"","",null,null,""]
[null,22,null,null,"","",null,null,""]
[null,null,null,null,"","",null,null,""]
["Classe 5","Classe","DIAZ","Acrosport","CP3","N","2014-05-06","2014-10-28","",{"$f":"IF(COUNTA(D29:D34)<=2,\"\",COUNTA(D29:D34))","v":3}]
[null,"3èE",null,"Demi-fond","CP1","N","2014-07-30","2014-11-05",""]
[null,null,null,"Rugby","CP4","N","2014-11-04","2014-11-05",""]
[null,"nbre d'élèves :   ",null,null,"","",null,null,""]
[null,23,null,null,"","",null,null,""]
[null,null,null,null,"","",null,null,""]
["Classe 6","Classe","prof6",null,"","",null,null,"",{"$f":"IF(COUNTA(D35:D40)<=2,\"\",COUNTA(D35:D40))","v":""}]
[null,"3è6",null,null,"","",null,null,""]
[null,null,null,null,"","",null,null,""]
[null,"nbre d'élèves :   ",null,null,"","",null,null,""]
[null,null,null,null,"","",null,null,""]
[null,null,null,null,"","",null,null,""]
["Classe 7","Classe","prof7",null,"","",null,null,{"$f":"IF(ISERROR(E41),1,\"\")","v":""},{"$f":"IF(COUNTA(D41:D46)<=2,\"\",COUNTA(D41:D46))","v":""}]
[null,"3è7",null,null,"","",null,null,{"$f":"IF(ISERROR(E42),1,\"\")","v":""}]
[null,null,null,null,"","",null,null,""]
[null,"nbre d'élèves :   ",null,null,"","",null,null,""]
[null,null,null,null,"","",null,null,""]
[null,null,null,null,"","",null,null,""]
["Classe 8","Classe","prof8",null,"","",null,null,"",{"$f":"IF(COUNTA(D47:D52)<=2,\"\",COUNTA(D47:D52))","v":""}]
[null,"3è8",null,null,"","",null,null,""]
[null,null,null,null,"","",null,null,""]
[null,"nbre d'élèves :   ",null,null,"","",null,null,""]
[null,null,null,null,"","",null,null,""]
[null,null,null,null,"","",null,null,""]
["Classe 9","Classe","prof9",null,"","",null,null,"",{"$f":"IF(COUNTA(D53:D58)<=2,\"\",COUNTA(D53:D58))","v":""}]
[null,"3è9",null,null,"","",null,null,""]
[null,null,null,null,"","",null,null,""]
[null,"nbre d'élèves :   ",null,null,"","",null,null,""]
[null,null,null,null,"","",null,null,""]
[null,null,null,null,"","",null,null,""]
["Classe 10","Classe","prof10",null,"","",null,null,"",{"$f":"IF(COUNTA(D59:D64)<=2,\"\",COUNTA(D59:D64))","v":""}]
[null,"3è10",null,null,"","",null,null,""]
[null,null,null,null,"","",null,null,""]
[null,"nbre d'élèves :   ",null,null,"","",null,null,""]
[null,null,null,null,"","",null,null,""]
[null,null,null,null,"","",null,null,""]
["Classe 11","Classe","prof11",null,"","",null,null,"",{"$f":"IF(COUNTA(D65:D70)<=2,\"\",COUNTA(D65:D70))","v":""}]
[null,"3è11",null,null,"","",null,null,""]
[null,null,null,null,"","",null,null,""]
[null,"nbre d'élèves :   ",null,null,"","",null,null,""]
[null,null,null,null,"","",null,null,""]
[null,null,null,null,"","",null,null,""]
["Classe 12","Classe","prof12",null,"","",null,null,"",{"$f":"IF(COUNTA(D71:D76)<=2,\"\",COUNTA(D71:D76))","v":""}]
[null,"3è12",null,null,"","",null,null,""]
[null,null,null,null,"","",null,null,""]
[null,"nbre d'élèves :   ",null,null,"","",null,null,""]
[null,null,null,null,"","",null,null,""]
[null,null,null,null,"","",null,null,""]
[null,null,null,null,null,null,null,null,{"$f":"IF(COUNT(I5:I76)=0,\"\",\"Attention, une ou plusieurs APSA du protocole sont mal saisies!\")","v":""},{"$f":"AVERAGE(J5:J71)","v":3}]
[null,"Date de validation par le chef d'établissement :",null,null,null,null,null,null,null,{"$f":"COUNT(J5:J71)","v":5}]
[null,"Informations à transmettre à l'inspection :"]
[]
[null,null,null,null,null,null,null,null,""]
[]
[null,"Partie reservée à l'inspection :"]

{"sheet":"9830625M","index":12,"n_rows":83,"n_cols":10,"rows_kept":83,"cut":false,"hidden":false,"merged":[[22,0,27,0],[22,2,27,2],[2,7,3,7],[2,6,3,6],[0,3,0,5],[2,1,3,1],[2,2,3,2],[2,3,3,3],[2,4,2,5],[52,0,57,0],[52,2,57,2],[34,0,39,0],[34,2,39,2],[4,0,9,0],[4,2,9,2],[10,0,15,0],[10,2,15,2],[16,0,21,0],[16,2,21,2],[40,0,45,0],[40,2,45,2],[46,0,51,0],[46,2,51,2],[28,0,33,0],[28,2,33,2],[64,0,69,0],[64,2,69,2],[70,0,75,0],[70,2,75,2],[58,0,63,0],[58,2,63,2]]}
["R","DNB 2014","9830625M","CLG PORTES DE FER ET SEGPA - NOUMEA",null,null,"PROVINCE SUD","Académie de Nouvelle-Calédonie",{"$f":"IF(C1=\"\",\"\",VLOOKUP(C1,etab,4,FALSE))","v":"public"}]
["GEBEPS_2014_IPR_PROTOCOLES_public_9830625M.xls",null,null,null,"",null,null,null,{"$f":"Données!M11","v":"V3_29/10/13"}]
[null,"CLASSES            évaluées pour le DNB","NOM \nde l'enseignant responsable de la classe","Activités","Compétences\npropres",null,"dates des évaluations","dates des rattrapages",null,"nbre APSA\n/ classe"]
[null,null,null,null,"CP","Liste"]
["Classe 1","Classe","F.SOHIER","Haies","CP1","N","2014-04-30","2014-05-07",{"$f":"IF(ISERROR(E5),1,\"\")","v":""},{"$f":"IF(COUNTA(D5:D10)<=2,\"\",COUNTA(D5:D10))","v":3}]
[null,"3è1",null,"Hand","CP4","N","2014-07-21","2014-07-28",{"$f":"IF(ISERROR(E6),1,\"\")","v":""}]
[null,null,null,"Va'a","CP2","A","2014-04-28","2014-05-05",""]
[null,"nbre d'élèves :   ",null,null,"","",null,null,""]
[null,null,null,null,"","",null,null,""]
[null,null,null,null,"","",null,null,""]
["Classe 2","Classe","R. DROUET","Haies","CP1","N","2014-05-07","2014-05-14","",{"$f":"IF(COUNTA(D11:D16)<=2,\"\",COUNTA(D11:D16))","v":3}]
[null,"3è2",null,"Hand","CP4","N","2014-04-25","2014-05-09",""]
[null,null,null,"Va'a","CP2","A","2014-10-29","2014-11-05",""]
[null,"nbre d'élèves :   ",null,null,"","",null,null,""]
[null,27,null,null,"","",null,null,""]
[null,null,null,null,"","",null,null,""]
["Classe 3","Classe","F.SOHIER","Haies","CP1","N","2014-05-07","2014-05-14","",{"$f":"IF(COUNTA(D17:D22)<=2,\"\",COUNTA(D17:D22))","v":3}]
[null,"3è3",null,"Hand","CP4","N","2014-04-25","2014-05-09",""]
[null,"         SEGPA",null,"Va'a","CP2","A","2014-10-29","2014-11-05",""]
[null,"nbre d'élèves :   ",null,null,"","",null,null,""]
[null,null,null,null,"","",null,null,""]
[null,null,null,null,"","",null,null,""]
["Classe 4","Classe","R. DROUET","Haies","CP1","N","2014-05-07","2014-05-14","",{"$f":"IF(COUNTA(D23:D28)<=2,\"\",COUNTA(D23:D28))","v":3}]
[null,"3è4",null,"Hand","CP4","N","2014-04-25","2014-05-09",""]
[null,"        SEGPA",null,"Va'a","CP2","A","2014-10-29","2014-11-05",""]
[null,"nbre d'élèves :   ",null,null,"","",null,null,""]
[null,null,null,null,"","",null,null,""]
[null,null,null,null,"","",null,null,""]
["Classe 5","Classe","R. DROUET","Haies","CP1","N","2014-05-05","2014-05-12","",{"$f":"IF(COUNTA(D29:D34)<=2,\"\",COUNTA(D29:D34))","v":3}]
[null,"3è5",null,"Hand","CP4","N","2014-04-30","2014-05-07",""]
[null,null,null,"Va'a","CP2","A","2014-10-29","2014-11-05",""]
[null,"nbre d'élèves :   ",null,null,"","",null,null,""]
[null,28,null,null,"","",null,null,""]
[null,null,null,null,"","",null,null,""]
["Classe 6","Classe","R. DROUET","Haies","CP1","N","2014-05-07","2014-05-14","",{"$f":"IF(COUNTA(D35:D40)<=2,\"\",COUNTA(D35:D40))","v":3}]
[null,"3è6",null,"Hand","CP4","N","2014-04-25","2014-05-09",""]
[null,null,null,"Va'a","CP2","A","2014-10-29","2014-11-05",""]
[null,"nbre d'élèves :   ",null,null,"","",null,null,""]
[null,26,null,null,"","",null,null,""]
[null,null,null,null,"","",null,null,""]
["Classe 7","Classe","F.SOHIER","Haies","CP1","N","2014-05-05","2014-05-12",{"$f":"IF(ISERROR(E41),1,\"\")","v":""},{"$f":"IF(COUNTA(D41:D46)<=2,\"\",COUNTA(D41:D46))","v":3}]
[null,"3è7",null,"Hand","CP4","N","2014-04-28","2014-05-05",{"$f":"IF(ISERROR(E42),1,\"\")","v":""}]
[null,null,null,"Va'a","CP2","A","2014-10-27","2014-11-03",""]
[null,"nbre d'élèves :   ",null,null,"","",null,null,""]
[null,null,null,null,"","",null,null,""]
[null,null,null,null,"","",null,null,""]
["Classe 8","Classe","B.SASSOON","Haies","CP1","N","2014-05-05","2014-05-12","",{"$f":"IF(COUNTA(D47:D52)<=2,\"\",COUNTA(D47:D52))","v":3}]
[null,"3è8",null,"Hand","CP4","N","2014-05-21","2014-05-28",""]
[null,null,null,"Va'a","CP2","A","2014-10-27","2014-11-03",""]
[null,"nbre d'élèves :   ",null,null,"","",null,null,""]
[null,null,null,null,"","",null,null,""]
[null,null,null,null,"","",null,null,""]
["Classe 9","Classe","prof9",null,"","",null,null,"",{"$f":"IF(COUNTA(D53:D58)<=2,\"\",COUNTA(D53:D58))","v":""}]
[null,"3è9",null,null,"","",null,null,""]
[null,null,null,null,"","",null,null,""]
[null,"nbre d'élèves :   ",null,null,"","",null,null,""]
[null,null,null,null,"","",null,null,""]
[null,null,null,null,"","",null,null,""]
["Classe 10","Classe","prof10",null,"","",null,null,"",{"$f":"IF(COUNTA(D59:D64)<=2,\"\",COUNTA(D59:D64))","v":""}]
[null,"3è10",null,null,"","",null,null,""]
[null,null,null,null,"","",null,null,""]
[null,"nbre d'élèves :   ",null,null,"","",null,null,""]
[null,null,null,null,"","",null,null,""]
[null,null,null,null,"","",null,null,""]
["Classe 11","Classe","prof11",null,"","",null,null,"",{"$f":"IF(COUNTA(D65:D70)<=2,\"\",COUNTA(D65:D70))","v":""}]
[null,"3è11",null,null,"","",null,null,""]
[null,null,null,null,"","",null,null,""]
[null,"nbre d'élèves :   ",null,null,"","",null,null,""]
[null,null,null,null,"","",null,null,""]
[null,null,null,null,"","",null,null,""]
["Classe 12","Classe","prof12",null,"","",null,null,"",{"$f":"IF(COUNTA(D71:D76)<=2,\"\",COUNTA(D71:D76))","v":""}]
[null,"3è12",null,null,"","",null,null,""]
[null,null,null,null,"","",null,null,""]
[null,"nbre d'élèves :   ",null,null,"","",null,null,""]
[null,null,null,null,"","",null,null,""]
[null,null,null,null,"","",null,null,""]
[null,null,null,null,null,null,null,null,{"$f":"IF(COUNT(I5:I76)=0,\"\",\"Attention, une ou plusieurs APSA du protocole sont mal saisies!\")","v":""},{"$f":"AVERAGE(J5:J71)","v":3}]
[null,"Date de validation par le chef d'établissement :",null,null,null,null,null,null,null,{"$f":"COUNT(J5:J71)","v":8}]
[null,"Informations à transmettre à l'inspection :"]
[]
[null,null,null,null,null,null,null,null,""]
[]
[null,"Partie reservée à l'inspection :"]

{"sheet":"9830624L","index":13,"n_rows":83,"n_cols":10,"rows_kept":83,"cut":false,"hidden":false,"merged":[[0,3,0,5],[2,1,3,1],[2,2,3,2],[2,3,3,3],[2,4,2,5],[2,7,3,7],[4,0,9,0],[4,2,9,2],[10,0,15,0],[10,2,15,2],[16,0,21,0],[16,2,21,2],[2,6,3,6],[58,0,63,0],[58,2,63,2],[22,0,27,0],[22,2,27,2],[28,0,33,0],[28,2,33,2],[34,0,39,0],[34,2,39,2],[64,0,69,0],[64,2,69,2],[70,0,75,0],[70,2,75,2],[40,0,45,0],[40,2,45,2],[46,0,51,0],[46,2,51,2],[52,0,57,0],[52,2,57,2]]}
["R","DNB 2014","9830624L","CLG DE PLUM",null,null,"PROVINCE SUD","Académie de Nouvelle-Calédonie",{"$f":"IF(C1=\"\",\"\",VLOOKUP(C1,etab,4,FALSE))","v":"public"}]
["GEBEPS_2014_IPR_PROTOCOLES_public_9830624L.xls",null,null,null,"",null,null,null,{"$f":"Données!M11","v":"V3_29/10/13"}]
[null,"CLASSES            évaluées pour le DNB","NOM \nde l'enseignant responsable de la classe","Activités","Compétences\npropres",null,"dates des évaluations","dates des rattrapages",null,"nbre APSA\n/ classe"]
[null,null,null,null,"CP","Liste"]
["Classe 1","Classe","NIQUET","Javelot","CP1","N","30/04/2014 et 7/05/2014","2014-05-14",{"$f":"IF(ISERROR(E5),1,\"\")","v":""},{"$f":"IF(COUNTA(D5:D10)<=2,\"\",COUNTA(D5:D10))","v":6}]
[null,"3èA",null,"Demi-fond","CP1","N","23 et 30/07/2014","2014-08-06",{"$f":"IF(ISERROR(E6),1,\"\")","v":""}]
[null,null,null,"CO","CP2","N","6 et 27/10","2014-11-03",""]
[null,"nbre d'élèves :   ",null,"Danse","CP3","N","8 et 29/10","2014-11-05",""]
[null,23,null,"Hand","CP4","N","21 et 28/07","2014-08-04",""]
[null,null,null,"Badminton","CP4","N","28/04 et 5/05","2014-05-12",""]
["Classe 2","Classe","FONTAINE","Javelot","CP1","N","3 et 24/04","2014-05-15","",{"$f":"IF(COUNTA(D11:D16)<=2,\"\",COUNTA(D11:D16))","v":6}]
[null,"3èB",null,"Demi-fond","CP1","N","24 et 31/07","2014-08-07",""]
[null,null,null,"CO","CP2","N","6 et 27/10","2014-11-03",""]
[null,"nbre d'élèves :   ",null,"Danse","CP3","N","9 et 30/10","2014-11-06",""]
[null,22,null,"Hand","CP4","N","21 et 28/07","2014-08-04",""]
[null,null,null,"Badminton","CP4","N","28/04 et 5/05","2014-05-12",""]
["Classe 3","Classe","NIQUET","Badminton","CP4","N","28/04 et 5/05","2014-05-12","",{"$f":"IF(COUNTA(D17:D22)<=2,\"\",COUNTA(D17:D22))","v":6}]
[null,"3èC",null,"CO","CP2","N","6 et 27/10","2014-11-03",""]
[null,null,null,"Hand","CP4","N","21 et 28/07","2014-08-04",""]
[null,"nbre d'élèves :   ",null,"Demi-fond","CP1","N","23 et 30/07/2014","2014-08-06",""]
[null,23,null,"Javelot","CP1","N","30/04 et 7/05","2014-05-14",""]
[null,null,null,"Danse","CP3","N","8 et 29/10","2014-11-05",""]
["Classe 4","Classe","DURAND","Badminton","CP4","N","30/04 et 7/05","2014-05-14","",{"$f":"IF(COUNTA(D23:D28)<=2,\"\",COUNTA(D23:D28))","v":6}]
[null,"3èD",null,"CO","CP2","N","8 et 29/10","2014-11-05",""]
[null,null,null,"Hand","CP4","N","9 et 16/07","2014-07-23",""]
[null,"nbre d'élèves :   ",null,"Demi-fond","CP1","N","1 et 7/07","2014-07-21",""]
[null,21,null,"Javelot","CP1","N","28/04 et 5/05","2014-05-12",""]
[null,null,null,"Danse","CP3","N","6 et 27/10","2014-11-03",""]
["Classe 5","Classe","DURAND","Badminton","CP4","N","4 et 25/05","2014-05-16","",{"$f":"IF(COUNTA(D29:D34)<=2,\"\",COUNTA(D29:D34))","v":6}]
[null,"3èE",null,"CO","CP2","N","3 et 10/10","2014-10-31",""]
[null,null,null,"Hand","CP4","N","25/07 et 1/08","2014-08-08",""]
[null,"nbre d'élèves :   ",null,"Demi-fond","CP1","N","21 et 28/07","2014-08-04",""]
[null,23,null,"Javelot","CP1","N","28/04 et 5/05","2014-05-12",""]
[null,null,null,"Danse","CP3","N","6 et 27/10","2014-11-03",""]
["Classe 6","Classe","GROS","Badminton","CP4","N","4 et 25/05","2014-05-16","",{"$f":"IF(COUNTA(D35:D40)<=2,\"\",COUNTA(D35:D40))","v":6}]
[null,"3èF",null,"CO","CP2","N","3 et 10/10","2014-10-31",""]
[null,null,null,"Hand","CP4","N","25/07 et 1/08","2014-08-08",""]
[null,"nbre d'élèves :   ",null,"Demi-fond","CP1","N","22 et 29/07","2014-08-05",""]
[null,21,null,"Javelot","CP1","N","29/04 et 6/05","2014-05-13",""]
[null,null,null,"Danse","CP3","N","7 et 28/10","2014-11-04",""]
["Classe 7","Classe","prof7",null,"","",null,null,{"$f":"IF(ISERROR(E41),1,\"\")","v":""},{"$f":"IF(COUNTA(D41:D46)<=2,\"\",COUNTA(D41:D46))","v":""}]
[null,"3è7",null,null,"","",null,null,{"$f":"IF(ISERROR(E42),1,\"\")","v":""}]
[null,null,null,null,"","",null,null,""]
[null,"nbre d'élèves :   ",null,null,"","",null,null,""]
[null,null,null,null,"","",null,null,""]
[null,null,null,null,"","",null,null,""]
["Classe 8","Classe","prof8",null,"","",null,null,"",{"$f":"IF(COUNTA(D47:D52)<=2,\"\",COUNTA(D47:D52))","v":""}]
[null,"3è8",null,null,"","",null,null,""]
[null,null,null,null,"","",null,null,""]
[null,"nbre d'élèves :   ",null,null,"","",null,null,""]
[null,null,null,null,"","",null,null,""]
[null,null,null,null,"","",null,null,""]
["Classe 9","Classe","prof9",null,"","",null,null,"",{"$f":"IF(COUNTA(D53:D58)<=2,\"\",COUNTA(D53:D58))","v":""}]
[null,"3è9",null,null,"","",null,null,""]
[null,null,null,null,"","",null,null,""]
[null,"nbre d'élèves :   ",null,null,"","",null,null,""]
[null,null,null,null,"","",null,null,""]
[null,null,null,null,"","",null,null,""]
["Classe 10","Classe","prof10",null,"","",null,null,"",{"$f":"IF(COUNTA(D59:D64)<=2,\"\",COUNTA(D59:D64))","v":""}]
[null,"3è10",null,null,"","",null,null,""]
[null,null,null,null,"","",null,null,""]
[null,"nbre d'élèves :   ",null,null,"","",null,null,""]
[null,null,null,null,"","",null,null,""]
[null,null,null,null,"","",null,null,""]
["Classe 11","Classe","prof11",null,"","",null,null,"",{"$f":"IF(COUNTA(D65:D70)<=2,\"\",COUNTA(D65:D70))","v":""}]
[null,"3è11",null,null,"","",null,null,""]
[null,null,null,null,"","",null,null,""]
[null,"nbre d'élèves :   ",null,null,"","",null,null,""]
[null,null,null,null,"","",null,null,""]
[null,null,null,null,"","",null,null,""]
["Classe 12","Classe","prof12",null,"","",null,null,"",{"$f":"IF(COUNTA(D71:D76)<=2,\"\",COUNTA(D71:D76))","v":""}]
[null,"3è12",null,null,"","",null,null,""]
[null,null,null,null,"","",null,null,""]
[null,"nbre d'élèves :   ",null,null,"","",null,null,""]
[null,null,null,null,"","",null,null,""]
[null,null,null,null,"","",null,null,""]
[null,null,null,null,null,null,null,null,{"$f":"IF(COUNT(I5:I76)=0,\"\",\"Attention, une ou plusieurs APSA du protocole sont mal saisies!\")","v":""},{"$f":"AVERAGE(J5:J71)","v":6}]
[null,"Date de validation par le chef d'établissement :",null,null,null,null,null,null,null,{"$f":"COUNT(J5:J71)","v":6}]
[null,"Informations à transmettre à l'inspection :"]
[]
[null,null,null,null,null,null,null,null,""]
[]
[null,"Partie reservée à l'inspection :"]

{"sheet":"9830616c","index":14,"n_rows":83,"n_cols":10,"rows_kept":83,"cut":false,"hidden":false,"merged":[[0,3,0,5],[2,1,3,1],[2,2,3,2],[2,3,3,3],[2,4,2,5],[2,7,3,7],[4,0,9,0],[4,2,9,2],[10,0,15,0],[10,2,15,2],[16,0,21,0],[16,2,21,2],[2,6,3,6],[58,0,63,0],[58,2,63,2],[22,0,27,0],[22,2,27,2],[28,0,33,0],[28,2,33,2],[34,0,39,0],[34,2,39,2],[64,0,69,0],[64,2,69,2],[70,0,75,0],[70,2,75,2],[40,0,45,0],[40,2,45,2],[46,0,51,0],[46,2,51,2],[52,0,57,0],[52,2,57,2]]}
["R","DNB 2014","9830616c","CLG LOUISE MICHEL DE PAITA SUD - PAITA",null,null,"PROVINCE SUD","Académie de Nouvelle-Calédonie",{"$f":"IF(C1=\"\",\"\",VLOOKUP(C1,etab,4,FALSE))","v":"public"}]
["GEBEPS_2014_IPR_PROTOCOLES_public_9830616c.xls",null,null,null,"",null,null,null,{"$f":"Données!M11","v":"V3_29/10/13"}]
[null,"CLASSES            évaluées pour le DNB","NOM \nde l'enseignant responsable de la classe","Activités","Compétences\npropres",null,"dates des évaluations","dates des rattrapages",null,"nbre APSA\n/ classe"]
[null,null,null,null,"CP","Liste"]
["Classe 1","Classe","prof1","Acrosport","CP3","N","2014-03-31","2014-04-28",{"$f":"IF(ISERROR(E5),1,\"\")","v":""},{"$f":"IF(COUNTA(D5:D10)<=2,\"\",COUNTA(D5:D10))","v":3}]
[null,"3è1",null,"Basket","CP4","N","2014-04-23","2014-04-30",{"$f":"IF(ISERROR(E6),1,\"\")","v":""}]
[null,null,null,"Demi-fond","CP1","N","2014-06-25","2014-07-09",""]
[null,"nbre d'élèves :   ",null,null,"","",null,null,""]
[null,26,null,null,"","",null,null,""]
[null,null,null,null,"","",null,null,""]
["Classe 2","Classe","prof2","Acrosport","CP3","N","2014-06-27","2014-11-05","",{"$f":"IF(COUNTA(D11:D16)<=2,\"\",COUNTA(D11:D16))","v":3}]
[null,"3è2",null,"Demi-fond","CP1","N","2014-07-30","2014-08-06",""]
[null,null,null,"Basket","CP4","N","2014-10-01","2014-10-08",""]
[null,"nbre d'élèves :   ",null,null,"","",null,null,""]
[null,27,null,null,"","",null,null,""]
[null,null,null,null,"","",null,null,""]
["Classe 3","Classe","prof3","Acrosport","CP3","N","2014-04-23","2014-04-30","",{"$f":"IF(COUNTA(D17:D22)<=2,\"\",COUNTA(D17:D22))","v":3}]
[null,"3è3",null,"Basket","CP4","N","2014-04-18","2014-04-25",""]
[null,null,null,"Demi-fond","CP1","N","2014-07-02","2014-07-09",""]
[null,"nbre d'élèves :   ",null,null,"","",null,null,""]
[null,19,null,null,"","",null,null,""]
[null,null,null,null,"","",null,null,""]
["Classe 4","Classe","prof4",null,"","",null,null,"",{"$f":"IF(COUNTA(D23:D28)<=2,\"\",COUNTA(D23:D28))","v":""}]
[null,"3è4",null,null,"","",null,null,""]
[null,null,null,null,"","",null,null,""]
[null,"nbre d'élèves :   ",null,null,"","",null,null,""]
[null,null,null,null,"","",null,null,""]
[null,null,null,null,"","",null,null,""]
["Classe 5","Classe","prof5",null,"","",null,null,"",{"$f":"IF(COUNTA(D29:D34)<=2,\"\",COUNTA(D29:D34))","v":""}]
[null,"3è5",null,null,"","",null,null,""]
[null,null,null,null,"","",null,null,""]
[null,"nbre d'élèves :   ",null,null,"","",null,null,""]
[null,null,null,null,"","",null,null,""]
[null,null,null,null,"","",null,null,""]
["Classe 6","Classe","prof6",null,"","",null,null,"",{"$f":"IF(COUNTA(D35:D40)<=2,\"\",COUNTA(D35:D40))","v":""}]
[null,"3è6",null,null,"","",null,null,""]
[null,null,null,null,"","",null,null,""]
[null,"nbre d'élèves :   ",null,null,"","",null,null,""]
[null,null,null,null,"","",null,null,""]
[null,null,null,null,"","",null,null,""]
["Classe 7","Classe","prof7",null,"","",null,null,{"$f":"IF(ISERROR(E41),1,\"\")","v":""},{"$f":"IF(COUNTA(D41:D46)<=2,\"\",COUNTA(D41:D46))","v":""}]
[null,"3è7",null,null,"","",null,null,{"$f":"IF(ISERROR(E42),1,\"\")","v":""}]
[null,null,null,null,"","",null,null,""]
[null,"nbre d'élèves :   ",null,null,"","",null,null,""]
[null,null,null,null,"","",null,null,""]
[null,null,null,null,"","",null,null,""]
["Classe 8","Classe","prof8",null,"","",null,null,"",{"$f":"IF(COUNTA(D47:D52)<=2,\"\",COUNTA(D47:D52))","v":""}]
[null,"3è8",null,null,"","",null,null,""]
[null,null,null,null,"","",null,null,""]
[null,"nbre d'élèves :   ",null,null,"","",null,null,""]
[null,null,null,null,"","",null,null,""]
[null,null,null,null,"","",null,null,""]
["Classe 9","Classe","prof9",null,"","",null,null,"",{"$f":"IF(COUNTA(D53:D58)<=2,\"\",COUNTA(D53:D58))","v":""}]
[null,"3è9",null,null,"","",null,null,""]
[null,null,null,null,"","",null,null,""]
[null,"nbre d'élèves :   ",null,null,"","",null,null,""]
[null,null,null,null,"","",null,null,""]
[null,null,null,null,"","",null,null,""]
["Classe 10","Classe","prof10",null,"","",null,null,"",{"$f":"IF(COUNTA(D59:D64)<=2,\"\",COUNTA(D59:D64))","v":""}]
[null,"3è10",null,null,"","",null,null,""]
[null,null,null,null,"","",null,null,""]
[null,"nbre d'élèves :   ",null,null,"","",null,null,""]
[null,null,null,null,"","",null,null,""]
[null,null,null,null,"","",null,null,""]
["Classe 11","Classe","prof11",null,"","",null,null,"",{"$f":"IF(COUNTA(D65:D70)<=2,\"\",COUNTA(D65:D70))","v":""}]
[null,"3è11",null,null,"","",null,null,""]
[null,null,null,null,"","",null,null,""]
[null,"nbre d'élèves :   ",null,null,"","",null,null,""]
[null,null,null,null,"","",null,null,""]
[null,null,null,null,"","",null,null,""]
["Classe 12","Classe","prof12",null,"","",null,null,"",{"$f":"IF(COUNTA(D71:D76)<=2,\"\",COUNTA(D71:D76))","v":""}]
[null,"3è12",null,null,"","",null,null,""]
[null,null,null,null,"","",null,null,""]
[null,"nbre d'élèves :   ",null,null,"","",null,null,""]
[null,null,null,null,"","",null,null,""]
[null,null,null,null,"","",null,null,""]
[null,null,null,null,null,null,null,null,{"$f":"IF(COUNT(I5:I76)=0,\"\",\"Attention, une ou plusieurs APSA du protocole sont mal saisies!\")","v":""},{"$f":"AVERAGE(J5:J71)","v":3}]
[null,"Date de validation par le chef d'établissement :",null,null,null,null,null,null,null,{"$f":"COUNT(J5:J71)","v":3}]
[null,"Informations à transmettre à l'inspection :"]
[]
[null,null,null,null,null,null,null,null,""]
[]
[null,"Partie reservée à l'inspection :"]

{"sheet":"9830538T","index":15,"n_rows":83,"n_cols":10,"rows_kept":83,"cut":false,"hidden":false,"merged":[[70,0,75,0],[70,2,75,2],[58,0,63,0],[58,2,63,2],[64,0,69,0],[64,2,69,2],[40,0,45,0],[40,2,45,2],[46,0,51,0],[46,2,51,2],[52,0,57,0],[52,2,57,2],[22,0,27,0],[22,2,27,2],[28,0,33,0],[28,2,33,2],[34,0,39,0],[34,2,39,2],[2,7,3,7],[4,0,9,0],[4,2,9,2],[10,0,15,0],[10,2,15,2],[16,0,21,0],[16,2,21,2],[0,3,0,5],[2,1,3,1],[2,2,3,2],[2,3,3,3],[2,4,2,5],[2,6,3,6]]}
["R","DNB 2014","9830538T","CLG DE NORMANDIE ET SEGPA",null,null,"PROVINCE SUD","Académie de Nouvelle-Calédonie",{"$f":"IF(C1=\"\",\"\",VLOOKUP(C1,etab,4,FALSE))","v":"public"}]
["GEBEPS_2014_IPR_PROTOCOLES_public_9830538T.xls",null,null,null,"",null,null,null,{"$f":"Données!M11","v":"V3_29/10/13"}]
[null,"CLASSES            évaluées pour le DNB","NOM \nde l'enseignant responsable de la classe","Activités","Compétences\npropres",null,"dates des évaluations","dates des rattrapages",null,"nbre APSA\n/ classe"]
[null,null,null,null,"CP","Liste"]
["Classe 1","Classe","CLAVEL","Volley","CP4","N","2014-04-03","2014-04-24",{"$f":"IF(ISERROR(E5),1,\"\")","v":""},{"$f":"IF(COUNTA(D5:D10)<=2,\"\",COUNTA(D5:D10))","v":3}]
[null,301,null,"CO","CP2","N","2014-07-24","2014-07-31",{"$f":"IF(ISERROR(E6),1,\"\")","v":""}]
[null,null,null,"Hauteur","CP1","N","2014-10-09","2014-10-30",""]
[null,26,null,null,"","",null,null,""]
[null,null,null,null,"","",null,null,""]
[null,null,null,null,"","",null,null,""]
["Classe 2","Classe","HAGNERE","Basket","CP4","N","2014-03-28","2014-04-04","",{"$f":"IF(COUNTA(D11:D16)<=2,\"\",COUNTA(D11:D16))","v":3}]
[null,302,null,"Acrosport","CP3","N","2014-10-31","2014-11-07",""]
[null,null,null,"Demi-fond","CP1","N","2014-10-29","2014-11-05",""]
[null,"nbre d'élèves :   ",null,null,"","",null,null,""]
[null,null,null,null,"","",null,null,""]
[null,null,null,null,"","",null,null,""]
["Classe 3","Classe","EHRHARDT","Haies","CP1","N","2014-04-29","2014-05-13","",{"$f":"IF(COUNTA(D17:D22)<=2,\"\",COUNTA(D17:D22))","v":3}]
[null,303,null,"CO","CP2","N","2014-07-22","2014-07-29",""]
[null,null,null,"Volley","CP4","N","2014-10-28","2014-11-04",""]
[null,"nbre d'élèves :   ",null,null,"","",null,null,""]
[null,27,null,null,"","",null,null,""]
[null,null,null,null,"","",null,null,""]
["Classe 4","Classe","HORENT","Volley","CP4","N","2014-04-29","2014-05-06","",{"$f":"IF(COUNTA(D23:D28)<=2,\"\",COUNTA(D23:D28))","v":3}]
[null,304,null,"Demi-fond","CP1","N","2014-07-22","2014-07-29",""]
[null,null,null,"CO","CP2","N","2014-10-28","2014-11-04",""]
[null,"nbre d'élèves :   ",null,null,"","",null,null,""]
[null,25,null,null,"","",null,null,""]
[null,null,null,null,"","",null,null,""]
["Classe 5","Classe","BLASQUEZ","Basket","CP4","N","2014-04-03","2014-04-24","",{"$f":"IF(COUNTA(D29:D34)<=2,\"\",COUNTA(D29:D34))","v":3}]
[null,305,null,"Demi-fond","CP1","N","2014-05-26","2014-06-02",""]
[null,null,null,"CO","CP2","N","2014-07-24","2014-07-31",""]
[null,"nbre d'élèves :   ",null,null,"","",null,null,""]
[null,27,null,null,"","",null,null,""]
[null,null,null,null,"","",null,null,""]
["Classe 6","Classe","prof6",null,"","",null,null,"",{"$f":"IF(COUNTA(D35:D40)<=2,\"\",COUNTA(D35:D40))","v":""}]
[null,"3è6",null,null,"","",null,null,""]
[null,null,null,null,"","",null,null,""]
[null,"nbre d'élèves :   ",null,null,"","",null,null,""]
[null,null,null,null,"","",null,null,""]
[null,null,null,null,"","",null,null,""]
["Classe 7","Classe","prof7",null,"","",null,null,{"$f":"IF(ISERROR(E41),1,\"\")","v":""},{"$f":"IF(COUNTA(D41:D46)<=2,\"\",COUNTA(D41:D46))","v":""}]
[null,"3è7",null,null,"","",null,null,{"$f":"IF(ISERROR(E42),1,\"\")","v":""}]
[null,null,null,null,"","",null,null,""]
[null,"nbre d'élèves :   ",null,null,"","",null,null,""]
[null,null,null,null,"","",null,null,""]
[null,null,null,null,"","",null,null,""]
["Classe 8","Classe","prof8",null,"","",null,null,"",{"$f":"IF(COUNTA(D47:D52)<=2,\"\",COUNTA(D47:D52))","v":""}]
[null,"3è8",null,null,"","",null,null,""]
[null,null,null,null,"","",null,null,""]
[null,"nbre d'élèves :   ",null,null,"","",null,null,""]
[null,null,null,null,"","",null,null,""]
[null,null,null,null,"","",null,null,""]
["Classe 9","Classe","prof9",null,"","",null,null,"",{"$f":"IF(COUNTA(D53:D58)<=2,\"\",COUNTA(D53:D58))","v":""}]
[null,"3è9",null,null,"","",null,null,""]
[null,null,null,null,"","",null,null,""]
[null,"nbre d'élèves :   ",null,null,"","",null,null,""]
[null,null,null,null,"","",null,null,""]
[null,null,null,null,"","",null,null,""]
["Classe 10","Classe","prof10",null,"","",null,null,"",{"$f":"IF(COUNTA(D59:D64)<=2,\"\",COUNTA(D59:D64))","v":""}]
[null,"3è10",null,null,"","",null,null,""]
[null,null,null,null,"","",null,null,""]
[null,"nbre d'élèves :   ",null,null,"","",null,null,""]
[null,null,null,null,"","",null,null,""]
[null,null,null,null,"","",null,null,""]
["Classe 11","Classe","prof11",null,"","",null,null,"",{"$f":"IF(COUNTA(D65:D70)<=2,\"\",COUNTA(D65:D70))","v":""}]
[null,"3è11",null,null,"","",null,null,""]
[null,null,null,null,"","",null,null,""]
[null,"nbre d'élèves :   ",null,null,"","",null,null,""]
[null,null,null,null,"","",null,null,""]
[null,null,null,null,"","",null,null,""]
["Classe 12","Classe","prof12",null,"","",null,null,"",{"$f":"IF(COUNTA(D71:D76)<=2,\"\",COUNTA(D71:D76))","v":""}]
[null,"3è12",null,null,"","",null,null,""]
[null,null,null,null,"","",null,null,""]
[null,"nbre d'élèves :   ",null,null,"","",null,null,""]
[null,null,null,null,"","",null,null,""]
[null,null,null,null,"","",null,null,""]
[null,null,null,null,null,null,null,null,{"$f":"IF(COUNT(I5:I76)=0,\"\",\"Attention, une ou plusieurs APSA du protocole sont mal saisies!\")","v":""},{"$f":"AVERAGE(J5:J71)","v":3}]
[null,"Date de validation par le chef d'établissement :",null,null,null,null,null,null,null,{"$f":"COUNT(J5:J71)","v":5}]
[null,"Informations à transmettre à l'inspection :"]
[]
[null,null,null,null,null,null,null,null,""]
[]
[null,"Partie reservée à l'inspection :"]

{"sheet":"9830524C","index":16,"n_rows":83,"n_cols":10,"rows_kept":83,"cut":false,"hidden":false,"merged":[[0,3,0,5],[2,1,3,1],[2,2,3,2],[2,3,3,3],[2,4,2,5],[2,7,3,7],[4,0,9,0],[4,2,9,2],[10,0,15,0],[10,2,15,2],[16,0,21,0],[16,2,21,2],[2,6,3,6],[58,0,63,0],[58,2,63,2],[22,0,27,0],[22,2,27,2],[28,0,33,0],[28,2,33,2],[34,0,39,0],[34,2,39,2],[64,0,69,0],[64,2,69,2],[70,0,75,0],[70,2,75,2],[40,0,45,0],[40,2,45,2],[46,0,51,0],[46,2,51,2],[52,0,57,0],[52,2,57,2]]}
["R","DNB 2014","9830524C","CLG DE KAMERE - NOUMEA",null,null,"PROVINCE SUD","Académie de Nouvelle-Calédonie",{"$f":"IF(C1=\"\",\"\",VLOOKUP(C1,etab,4,FALSE))","v":"public"}]
["GEBEPS_2014_IPR_PROTOCOLES_public_9830524C.xls",null,null,null,"",null,null,null,{"$f":"Données!M11","v":"V3_29/10/13"}]
[null,"CLASSES            évaluées pour le DNB","NOM \nde l'enseignant responsable de la classe","Activités","Compétences\npropres",null,"dates des évaluations","dates des rattrapages",null,"nbre APSA\n/ classe"]
[null,null,null,null,"CP","Liste"]
["Classe 1","Classe","Mme LE VAN","Javelot","CP1","N","2014-04-04","2014-04-25",{"$f":"IF(ISERROR(E5),1,\"\")","v":""},{"$f":"IF(COUNTA(D5:D10)<=2,\"\",COUNTA(D5:D10))","v":3}]
[null,"3èA",null,"CO","CP2","N","2014-07-25","2014-08-01",{"$f":"IF(ISERROR(E6),1,\"\")","v":""}]
[null,null,null,"Volley","CP4","N","2014-10-31","2014-11-07",""]
[null,"nbre d'élèves :   ",null,null,"","",null,null,""]
[null,26,null,null,"","",null,null,""]
[null,null,null,null,"","",null,null,""]
["Classe 2","Classe","M. RENARD","Javelot","CP1","N","2014-04-28","2014-05-05","",{"$f":"IF(COUNTA(D11:D16)<=2,\"\",COUNTA(D11:D16))","v":3}]
[null,"3èB",null,"CO","CP2","N","2014-07-21","2014-07-28",""]
[null,null,null,"Volley","CP4","N","2014-10-27","2014-11-03",""]
[null,"nbre d'élèves :   ",null,null,"","",null,null,""]
[null,26,null,null,"","",null,null,""]
[null,null,null,null,"","",null,null,""]
["Classe 3","Classe","M. MANDOU","Volley","CP4","N","2014-04-29","2014-05-06","",{"$f":"IF(COUNTA(D17:D22)<=2,\"\",COUNTA(D17:D22))","v":3}]
[null,"3èC",null,"Javelot","CP1","N","2014-07-22","2014-07-29",""]
[null,null,null,"CO","CP2","N","2014-10-28","2014-11-04",""]
[null,"nbre d'élèves :   ",null,null,"","",null,null,""]
[null,21,null,null,"","",null,null,""]
[null,null,null,null,"","",null,null,""]
["Classe 4","Classe","M. BET","Volley","CP4","N","2014-04-04","2014-04-25","",{"$f":"IF(COUNTA(D23:D28)<=2,\"\",COUNTA(D23:D28))","v":3}]
[null,"3èD",null,"Javelot","CP1","N","2014-07-25","2014-08-01",""]
[null,null,null,"CO","CP2","N","2014-10-31","2014-11-07",""]
[null,"nbre d'élèves :   ",null,null,"","",null,null,""]
[null,26,null,null,"","",null,null,""]
[null,null,null,null,"","",null,null,""]
["Classe 5","Classe","M. RENARD","Javelot","CP1","N","2014-04-29","2014-05-06","",{"$f":"IF(COUNTA(D29:D34)<=2,\"\",COUNTA(D29:D34))","v":3}]
[null,"3èE",null,"CO","CP2","N","2014-07-22","2014-07-29",""]
[null,null,null,"Volley","CP4","N","2014-10-28","2014-11-04",""]
[null,"nbre d'élèves :   ",null,null,"","",null,null,""]
[null,null,null,null,"","",null,null,""]
[null,15,null,null,"","",null,null,""]
["Classe 6","Classe","M. WALTZING","CO","CP2","N","2014-04-04","2014-04-25","",{"$f":"IF(COUNTA(D35:D40)<=2,\"\",COUNTA(D35:D40))","v":3}]
[null,"3èF",null,"Volley","CP4","N","2014-07-25","2014-08-01",""]
[null,null,null,"Javelot","CP1","N","2014-10-31","2014-11-07",""]
[null,"nbre d'élèves :   ",null,null,"","",null,null,""]
[null,17,null,null,"","",null,null,""]
[null,null,null,null,"","",null,null,""]
["Classe 7","Classe","M. MANDOU","Volley","CP4","N","2014-04-28","2014-05-05",{"$f":"IF(ISERROR(E41),1,\"\")","v":""},{"$f":"IF(COUNTA(D41:D46)<=2,\"\",COUNTA(D41:D46))","v":3}]
[null,"3èG",null,"CO","CP2","N","2014-07-21","2014-07-28",{"$f":"IF(ISERROR(E42),1,\"\")","v":""}]
[null,null,null,"Javelot","CP1","N","2014-10-27","2014-11-03",""]
[null,"nbre d'élèves :   ",null,null,"","",null,null,""]
[null,22,null,null,"","",null,null,""]
[null,null,null,null,"","",null,null,""]
["Classe 8","Classe","prof8",null,"","",null,null,"",{"$f":"IF(COUNTA(D47:D52)<=2,\"\",COUNTA(D47:D52))","v":""}]
[null,"3è8",null,null,"","",null,null,""]
[null,null,null,null,"","",null,null,""]
[null,"nbre d'élèves :   ",null,null,"","",null,null,""]
[null,null,null,null,"","",null,null,""]
[null,null,null,null,"","",null,null,""]
["Classe 9","Classe","prof9",null,"","",null,null,"",{"$f":"IF(COUNTA(D53:D58)<=2,\"\",COUNTA(D53:D58))","v":""}]
[null,"3è9",null,null,"","",null,null,""]
[null,null,null,null,"","",null,null,""]
[null,"nbre d'élèves :   ",null,null,"","",null,null,""]
[null,null,null,null,"","",null,null,""]
[null,null,null,null,"","",null,null,""]
["Classe 10","Classe","prof10",null,"","",null,null,"",{"$f":"IF(COUNTA(D59:D64)<=2,\"\",COUNTA(D59:D64))","v":""}]
[null,"3è10",null,null,"","",null,null,""]
[null,null,null,null,"","",null,null,""]
[null,"nbre d'élèves :   ",null,null,"","",null,null,""]
[null,null,null,null,"","",null,null,""]
[null,null,null,null,"","",null,null,""]
["Classe 11","Classe","prof11",null,"","",null,null,"",{"$f":"IF(COUNTA(D65:D70)<=2,\"\",COUNTA(D65:D70))","v":""}]
[null,"3è11",null,null,"","",null,null,""]
[null,null,null,null,"","",null,null,""]
[null,"nbre d'élèves :   ",null,null,"","",null,null,""]
[null,null,null,null,"","",null,null,""]
[null,null,null,null,"","",null,null,""]
["Classe 12","Classe","prof12",null,"","",null,null,"",{"$f":"IF(COUNTA(D71:D76)<=2,\"\",COUNTA(D71:D76))","v":""}]
[null,"3è12",null,null,"","",null,null,""]
[null,null,null,null,"","",null,null,""]
[null,"nbre d'élèves :   ",null,null,"","",null,null,""]
[null,null,null,null,"","",null,null,""]
[null,null,null,null,"","",null,null,""]
[null,null,null,null,null,null,null,null,{"$f":"IF(COUNT(I5:I76)=0,\"\",\"Attention, une ou plusieurs APSA du protocole sont mal saisies!\")","v":""},{"$f":"AVERAGE(J5:J71)","v":3}]
[null,"Date de validation par le chef d'établissement :",null,null,null,null,null,null,null,{"$f":"COUNT(J5:J71)","v":7}]
[null,"Informations à transmettre à l'inspection :"]
[]
[null,null,null,null,null,null,null,null,""]
[]
[null,"Partie reservée à l'inspection :"]

{"sheet":"9830522A","index":17,"n_rows":83,"n_cols":10,"rows_kept":83,"cut":false,"hidden":false,"merged":[[0,3,0,5],[2,1,3,1],[2,2,3,2],[2,3,3,3],[2,4,2,5],[2,7,3,7],[4,0,9,0],[4,2,9,2],[10,0,15,0],[10,2,15,2],[16,0,21,0],[16,2,21,2],[2,6,3,6],[58,0,63,0],[58,2,63,2],[22,0,27,0],[22,2,27,2],[28,0,33,0],[28,2,33,2],[34,0,39,0],[34,2,39,2],[64,0,69,0],[64,2,69,2],[70,0,75,0],[70,2,75,2],[40,0,45,0],[40,2,45,2],[46,0,51,0],[46,2,51,2],[52,0,57,0],[52,2,57,2]]}
["R","DNB 2014","9830522A","CLG PAI-KALEONE - HIENGHENE",null,null,"PROVINCE NORD","Académie de Nouvelle-Calédonie",{"$f":"IF(C1=\"\",\"\",VLOOKUP(C1,etab,4,FALSE))","v":"public"}]
["GEBEPS_2014_IPR_PROTOCOLES_public_9830522A.xls",null,null,null,"",null,null,null,{"$f":"Données!M11","v":"V3_29/10/13"}]
[null,"CLASSES            évaluées pour le DNB","NOM \nde l'enseignant responsable de la classe","Activités","Compétences\npropres",null,"dates des évaluations","dates des rattrapages",null,"nbre APSA\n/ classe"]
[null,null,null,null,"CP","Liste"]
["Classe 1","Menu A/C/E","Mmes Alatadill et Conway","Demi-fond","CP1","N","2014-07-21","2014-07-28",{"$f":"IF(ISERROR(E5),1,\"\")","v":""},{"$f":"IF(COUNTA(D5:D10)<=2,\"\",COUNTA(D5:D10))","v":5}]
[null,"3è1/3è2/3è3",null,"Canoë-Kayak","CP2","N","2014-04-03","2014-04-24",{"$f":"IF(ISERROR(E6),1,\"\")","v":""}]
[null,null,null,"Foot","CP4","N","2014-04-04","2014-04-25",""]
[null,34,null,"Volley","CP4","N","2014-07-25","2014-08-01",""]
[null,null,null,"Danse","CP3","N","2014-07-22","2014-07-29",""]
[null,null,null,null,"","",null,null,""]
["Classe 2","Menu B/D","Mmes Alatadill et Conway","Demi-fond","CP1","N","2014-07-21","2014-07-28","",{"$f":"IF(COUNTA(D11:D16)<=2,\"\",COUNTA(D11:D16))","v":4}]
[null,"3è1/3è2/3è3",null,"Planche à voile","CP2","A","2014-04-03","2014-04-24",""]
[null,null,null,"Volley","CP4","N","2014-07-25","2014-08-01",""]
[null,19,null,"Danse","CP3","N","2014-07-22","2014-07-29",""]
[null,null,null,null,"","",null,null,""]
[null,null,null,null,"","",null,null,""]
["Classe 3","Menu F","Mmes Alatadill et Conway","Planche à voile","CP2","A","2014-04-03","2014-04-24","",{"$f":"IF(COUNTA(D17:D22)<=2,\"\",COUNTA(D17:D22))","v":3}]
[null,"3è1/3è2/3è3",null,"Badminton","CP4","N","2014-04-28","2014-05-05",""]
[null,null,null,"Demi-fond","CP1","N","2014-07-21","2014-07-28",""]
[null,4,null,null,"","",null,null,""]
[null,null,null,null,"","",null,null,""]
[null,null,null,null,"","",null,null,""]
["Classe 4","Menu H/I","Mmes Alatadill et Conway","Demi-fond","CP1","N","2014-07-21","2014-07-28","",{"$f":"IF(COUNTA(D23:D28)<=2,\"\",COUNTA(D23:D28))","v":4}]
[null,"3è1/3è2/3è3",null,"Danse","CP3","N","2014-07-22","2014-07-29",""]
[null,null,null,"Badminton","CP4","N","2014-04-28","2014-05-05",""]
[null,4,null,"Planche à voile","CP2","A","2014-04-03","2014-04-24",""]
[null,null,null,null,"","",null,null,""]
[null,null,null,null,"","",null,null,""]
["Classe 5",null,null,null,"","",null,null,"",{"$f":"IF(COUNTA(D29:D34)<=2,\"\",COUNTA(D29:D34))","v":""}]
[null,null,null,null,"","",null,null,""]
[null,null,null,null,"","",null,null,""]
[null,null,null,null,"","",null,null,""]
[null,null,null,null,"","",null,null,""]
[null,null,null,null,"","",null,null,""]
["Classe 6",null,null,null,"","",null,null,"",{"$f":"IF(COUNTA(D35:D40)<=2,\"\",COUNTA(D35:D40))","v":""}]
[null,null,null,null,"","",null,null,""]
[null,null,null,null,"","",null,null,""]
[null,null,null,null,"","",null,null,""]
[null,null,null,null,"","",null,null,""]
[null,null,null,null,"","",null,null,""]
["Classe 7",null,null,null,"","",null,null,{"$f":"IF(ISERROR(E41),1,\"\")","v":""},{"$f":"IF(COUNTA(D41:D46)<=2,\"\",COUNTA(D41:D46))","v":""}]
[null,null,null,null,"","",null,null,{"$f":"IF(ISERROR(E42),1,\"\")","v":""}]
[null,null,null,null,"","",null,null,""]
[null,null,null,null,"","",null,null,""]
[null,null,null,null,"","",null,null,""]
[null,null,null,null,"","",null,null,""]
["Classe 8",null,null,null,"","",null,null,"",{"$f":"IF(COUNTA(D47:D52)<=2,\"\",COUNTA(D47:D52))","v":""}]
[null,null,null,null,"","",null,null,""]
[null,null,null,null,"","",null,null,""]
[null,null,null,null,"","",null,null,""]
[null,null,null,null,"","",null,null,""]
[null,null,null,null,"","",null,null,""]
["Classe 9",null,null,null,"","",null,null,"",{"$f":"IF(COUNTA(D53:D58)<=2,\"\",COUNTA(D53:D58))","v":""}]
[null,null,null,null,"","",null,null,""]
[null,null,null,null,"","",null,null,""]
[null,null,null,null,"","",null,null,""]
[null,null,null,null,"","",null,null,""]
[null,null,null,null,"","",null,null,""]
["Classe 10",null,null,null,"","",null,null,"",{"$f":"IF(COUNTA(D59:D64)<=2,\"\",COUNTA(D59:D64))","v":""}]
[null,null,null,null,"","",null,null,""]
[null,null,null,null,"","",null,null,""]
[null,null,null,null,"","",null,null,""]
[null,null,null,null,"","",null,null,""]
[null,null,null,null,"","",null,null,""]
["Classe 11",null,null,null,"","",null,null,"",{"$f":"IF(COUNTA(D65:D70)<=2,\"\",COUNTA(D65:D70))","v":""}]
[null,null,null,null,"","",null,null,""]
[null,null,null,null,"","",null,null,""]
[null,null,null,null,"","",null,null,""]
[null,null,null,null,"","",null,null,""]
[null,null,null,null,"","",null,null,""]
["Classe 12",null,null,null,"","",null,null,"",{"$f":"IF(COUNTA(D71:D76)<=2,\"\",COUNTA(D71:D76))","v":""}]
[null,null,null,null,"","",null,null,""]
[null,null,null,null,"","",null,null,""]
[null,null,null,null,"","",null,null,""]
[null,null,null,null,"","",null,null,""]
[null,null,null,null,"","",null,null,""]
[null,null,null,null,null,null,null,null,{"$f":"IF(COUNT(I5:I76)=0,\"\",\"Attention, une ou plusieurs APSA du protocole sont mal saisies!\")","v":""},{"$f":"AVERAGE(J5:J71)","v":4}]
[null,"Date de validation par le chef d'établissement :",null,null,null,null,null,null,null,{"$f":"COUNT(J5:J71)","v":4}]
[null,"Informations à transmettre à l'inspection :"]
[]
[null,null,null,null,null,null,null,null,""]
[]
[null,"Partie reservée à l'inspection :"]

{"sheet":"9830508K","index":18,"n_rows":83,"n_cols":10,"rows_kept":83,"cut":false,"hidden":false,"merged":[[0,3,0,5],[2,1,3,1],[2,2,3,2],[2,3,3,3],[2,4,2,5],[2,7,3,7],[4,0,9,0],[4,2,9,2],[10,0,15,0],[10,2,15,2],[16,0,21,0],[16,2,21,2],[2,6,3,6],[58,0,63,0],[58,2,63,2],[22,0,27,0],[22,2,27,2],[28,0,33,0],[28,2,33,2],[34,0,39,0],[34,2,39,2],[64,0,69,0],[64,2,69,2],[70,0,75,0],[70,2,75,2],[40,0,45,0],[40,2,45,2],[46,0,51,0],[46,2,51,2],[52,0,57,0],[52,2,57,2]]}
["R","DNB 2014","9830508K","ALP VALLEE DU TIR",null,null,"PROVINCE SUD","Académie de Nouvelle-Calédonie",{"$f":"IF(C1=\"\",\"\",VLOOKUP(C1,etab,4,FALSE))","v":"public"}]
["GEBEPS_2014_IPR_PROTOCOLES_public_9830508K.xls",null,null,null,"",null,null,null,{"$f":"Données!M11","v":"V3_29/10/13"}]
[null,"CLASSES            évaluées pour le DNB","NOM \nde l'enseignant responsable de la classe","Activités","Compétences\npropres",null,"dates des évaluations","dates des rattrapages",null,"nbre APSA\n/ classe"]
[null,null,null,null,"CP","Liste"]
["Classe 1","Classe","BET","Volley","CP4","N","2014-04-30","2014-05-07",{"$f":"IF(ISERROR(E5),1,\"\")","v":""},{"$f":"IF(COUNTA(D5:D10)<=2,\"\",COUNTA(D5:D10))","v":3}]
[null,"3è1",null,"Demi-fond","CP1","N","2014-07-23","2014-07-30",{"$f":"IF(ISERROR(E6),1,\"\")","v":""}]
[null,null,null,"CO","CP2","N","2014-09-29","2014-11-05",""]
[null,"nbre d'élèves :   ",null,null,"","",null,null,""]
[null,23,null,null,"","",null,null,""]
[null,null,null,null,"","",null,null,""]
["Classe 2","Classe","BET","Volley","CP4","N","2014-04-30","2014-05-07","",{"$f":"IF(COUNTA(D11:D16)<=2,\"\",COUNTA(D11:D16))","v":3}]
[null,"3è2",null,"Demi-fond","CP1","N","2014-07-23","2014-07-30",""]
[null,null,null,"CO","CP2","N","2014-09-29","2014-11-05",""]
[null,"nbre d'élèves :   ",null,null,"","",null,null,""]
[null,21,null,null,"","",null,null,""]
[null,null,null,null,"","",null,null,""]
["Classe 3","Classe","prof3",null,"","",null,null,"",{"$f":"IF(COUNTA(D17:D22)<=2,\"\",COUNTA(D17:D22))","v":""}]
[null,"3è3",null,null,"","",null,null,""]
[null,null,null,null,"","",null,null,""]
[null,"nbre d'élèves :   ",null,null,"","",null,null,""]
[null,null,null,null,"","",null,null,""]
[null,null,null,null,"","",null,null,""]
["Classe 4","Classe","prof4",null,"","",null,null,"",{"$f":"IF(COUNTA(D23:D28)<=2,\"\",COUNTA(D23:D28))","v":""}]
[null,"3è4",null,null,"","",null,null,""]
[null,null,null,null,"","",null,null,""]
[null,"nbre d'élèves :   ",null,null,"","",null,null,""]
[null,null,null,null,"","",null,null,""]
[null,null,null,null,"","",null,null,""]
["Classe 5","Classe","prof5",null,"","",null,null,"",{"$f":"IF(COUNTA(D29:D34)<=2,\"\",COUNTA(D29:D34))","v":""}]
[null,"3è5",null,null,"","",null,null,""]
[null,null,null,null,"","",null,null,""]
[null,"nbre d'élèves :   ",null,null,"","",null,null,""]
[null,null,null,null,"","",null,null,""]
[null,null,null,null,"","",null,null,""]
["Classe 6","Classe","prof6",null,"","",null,null,"",{"$f":"IF(COUNTA(D35:D40)<=2,\"\",COUNTA(D35:D40))","v":""}]
[null,"3è6",null,null,"","",null,null,""]
[null,null,null,null,"","",null,null,""]
[null,"nbre d'élèves :   ",null,null,"","",null,null,""]
[null,null,null,null,"","",null,null,""]
[null,null,null,null,"","",null,null,""]
["Classe 7","Classe","prof7",null,"","",null,null,{"$f":"IF(ISERROR(E41),1,\"\")","v":""},{"$f":"IF(COUNTA(D41:D46)<=2,\"\",COUNTA(D41:D46))","v":""}]
[null,"3è7",null,null,"","",null,null,{"$f":"IF(ISERROR(E42),1,\"\")","v":""}]
[null,null,null,null,"","",null,null,""]
[null,"nbre d'élèves :   ",null,null,"","",null,null,""]
[null,null,null,null,"","",null,null,""]
[null,null,null,null,"","",null,null,""]
["Classe 8","Classe","prof8",null,"","",null,null,"",{"$f":"IF(COUNTA(D47:D52)<=2,\"\",COUNTA(D47:D52))","v":""}]
[null,"3è8",null,null,"","",null,null,""]
[null,null,null,null,"","",null,null,""]
[null,"nbre d'élèves :   ",null,null,"","",null,null,""]
[null,null,null,null,"","",null,null,""]
[null,null,null,null,"","",null,null,""]
["Classe 9","Classe","prof9",null,"","",null,null,"",{"$f":"IF(COUNTA(D53:D58)<=2,\"\",COUNTA(D53:D58))","v":""}]
[null,"3è9",null,null,"","",null,null,""]
[null,null,null,null,"","",null,null,""]
[null,"nbre d'élèves :   ",null,null,"","",null,null,""]
[null,null,null,null,"","",null,null,""]
[null,null,null,null,"","",null,null,""]
["Classe 10","Classe","prof10",null,"","",null,null,"",{"$f":"IF(COUNTA(D59:D64)<=2,\"\",COUNTA(D59:D64))","v":""}]
[null,"3è10",null,null,"","",null,null,""]
[null,null,null,null,"","",null,null,""]
[null,"nbre d'élèves :   ",null,null,"","",null,null,""]
[null,null,null,null,"","",null,null,""]
[null,null,null,null,"","",null,null,""]
["Classe 11","Classe","prof11",null,"","",null,null,"",{"$f":"IF(COUNTA(D65:D70)<=2,\"\",COUNTA(D65:D70))","v":""}]
[null,"3è11",null,null,"","",null,null,""]
[null,null,null,null,"","",null,null,""]
[null,"nbre d'élèves :   ",null,null,"","",null,null,""]
[null,null,null,null,"","",null,null,""]
[null,null,null,null,"","",null,null,""]
["Classe 12","Classe","prof12",null,"","",null,null,"",{"$f":"IF(COUNTA(D71:D76)<=2,\"\",COUNTA(D71:D76))","v":""}]
[null,"3è12",null,null,"","",null,null,""]
[null,null,null,null,"","",null,null,""]
[null,"nbre d'élèves :   ",null,null,"","",null,null,""]
[null,null,null,null,"","",null,null,""]
[null,null,null,null,"","",null,null,""]
[null,null,null,null,null,null,null,null,{"$f":"IF(COUNT(I5:I76)=0,\"\",\"Attention, une ou plusieurs APSA du protocole sont mal saisies!\")","v":""},{"$f":"AVERAGE(J5:J71)","v":3}]
[null,"Date de validation par le chef d'établissement :",null,null,null,null,"2014-02-28",null,null,{"$f":"COUNT(J5:J71)","v":2}]
[null,"Informations à transmettre à l'inspection :"]
[]
[null,null,null,null,null,null,null,null,""]
[]
[null,"Partie reservée à l'inspection :"]

{"sheet":"9830493U","index":19,"n_rows":83,"n_cols":10,"rows_kept":83,"cut":false,"hidden":false,"merged":[[64,0,69,0],[64,2,69,2],[70,0,75,0],[70,2,75,2],[46,0,51,0],[46,2,51,2],[52,0,57,0],[52,2,57,2],[58,0,63,0],[58,2,63,2],[22,0,27,0],[22,2,27,2],[28,0,33,0],[28,2,33,2],[34,0,39,0],[34,2,39,2],[40,0,45,0],[40,2,45,2],[4,0,9,0],[4,2,9,2],[10,0,15,0],[10,2,15,2],[16,0,21,0],[16,2,21,2],[0,3,0,5],[2,1,3,1],[2,2,3,2],[2,3,3,3],[2,4,2,5],[2,7,3,7],[2,6,3,6]]}
["R","DNB 2014","9830493U","CLG DE POYA",null,null,"PROVINCE NORD","Académie de Nouvelle-Calédonie",{"$f":"IF(C1=\"\",\"\",VLOOKUP(C1,etab,4,FALSE))","v":"public"}]
["GEBEPS_2014_IPR_PROTOCOLES_public_9830493U.xls",null,null,null,"",null,null,null,{"$f":"Données!M11","v":"V3_29/10/13"}]
[null,"CLASSES            évaluées pour le DNB","NOM \nde l'enseignant responsable de la classe","Activités","Compétences\npropres",null,"dates des évaluations","dates des rattrapages",null,"nbre APSA\n/ classe"]
[null,null,null,null,"CP","Liste"]
["Classe 1","Classe","Mme Pastor","Voile","CP2","A","2014-04-28","2014-05-05",{"$f":"IF(ISERROR(E5),1,\"\")","v":""},{"$f":"IF(COUNTA(D5:D10)<=2,\"\",COUNTA(D5:D10))","v":4}]
[null,"3èA",null,"Tennis de table","CP4","N","2014-06-23","2014-06-30",{"$f":"IF(ISERROR(E6),1,\"\")","v":""}]
[null,null,null,"Demi-fond","CP1","N","2014-09-15","2014-09-22",""]
[null,"nbre d'élèves :   ",null,"Acrosport","CP3","N","2014-11-03","2014-11-10",""]
[null,21,null,null,"","",null,null,""]
[null,null,null,null,"","",null,null,""]
["Classe 2","Classe","Mme Pastor","Voile","CP2","A","2014-04-24","2014-05-15","",{"$f":"IF(COUNTA(D11:D16)<=2,\"\",COUNTA(D11:D16))","v":4}]
[null,"3èB",null,"Tennis de table","CP4","N","2014-06-26","2014-07-03",""]
[null,null,null,"Demi-fond","CP1","N","2014-09-18","2014-09-25",""]
[null,"nbre d'élèves :   ",null,"Acrosport","CP3","N","2014-10-30","2014-11-06",""]
[null,20,null,null,"","",null,null,""]
[null,null,null,null,"","",null,null,""]
["Classe 3","Classe","prof3",null,"","",null,null,"",{"$f":"IF(COUNTA(D17:D22)<=2,\"\",COUNTA(D17:D22))","v":""}]
[null,"3è3",null,null,"","",null,null,""]
[null,null,null,null,"","",null,null,""]
[null,"nbre d'élèves :   ",null,null,"","",null,null,""]
[null,null,null,null,"","",null,null,""]
[null,null,null,null,"","",null,null,""]
["Classe 4","Classe","prof4",null,"","",null,null,"",{"$f":"IF(COUNTA(D23:D28)<=2,\"\",COUNTA(D23:D28))","v":""}]
[null,"3è4",null,null,"","",null,null,""]
[null,null,null,null,"","",null,null,""]
[null,"nbre d'élèves :   ",null,null,"","",null,null,""]
[null,null,null,null,"","",null,null,""]
[null,null,null,null,"","",null,null,""]
["Classe 5","Classe","prof5",null,"","",null,null,"",{"$f":"IF(COUNTA(D29:D34)<=2,\"\",COUNTA(D29:D34))","v":""}]
[null,"3è5",null,null,"","",null,null,""]
[null,null,null,null,"","",null,null,""]
[null,"nbre d'élèves :   ",null,null,"","",null,null,""]
[null,null,null,null,"","",null,null,""]
[null,null,null,null,"","",null,null,""]
["Classe 6","Classe","prof6",null,"","",null,null,"",{"$f":"IF(COUNTA(D35:D40)<=2,\"\",COUNTA(D35:D40))","v":""}]
[null,"3è6",null,null,"","",null,null,""]
[null,null,null,null,"","",null,null,""]
[null,"nbre d'élèves :   ",null,null,"","",null,null,""]
[null,null,null,null,"","",null,null,""]
[null,null,null,null,"","",null,null,""]
["Classe 7","Classe","prof7",null,"","",null,null,{"$f":"IF(ISERROR(E41),1,\"\")","v":""},{"$f":"IF(COUNTA(D41:D46)<=2,\"\",COUNTA(D41:D46))","v":""}]
[null,"3è7",null,null,"","",null,null,{"$f":"IF(ISERROR(E42),1,\"\")","v":""}]
[null,null,null,null,"","",null,null,""]
[null,"nbre d'élèves :   ",null,null,"","",null,null,""]
[null,null,null,null,"","",null,null,""]
[null,null,null,null,"","",null,null,""]
["Classe 8","Classe","prof8",null,"","",null,null,"",{"$f":"IF(COUNTA(D47:D52)<=2,\"\",COUNTA(D47:D52))","v":""}]
[null,"3è8",null,null,"","",null,null,""]
[null,null,null,null,"","",null,null,""]
[null,"nbre d'élèves :   ",null,null,"","",null,null,""]
[null,null,null,null,"","",null,null,""]
[null,null,null,null,"","",null,null,""]
["Classe 9","Classe","prof9",null,"","",null,null,"",{"$f":"IF(COUNTA(D53:D58)<=2,\"\",COUNTA(D53:D58))","v":""}]
[null,"3è9",null,null,"","",null,null,""]
[null,null,null,null,"","",null,null,""]
[null,"nbre d'élèves :   ",null,null,"","",null,null,""]
[null,null,null,null,"","",null,null,""]
[null,null,null,null,"","",null,null,""]
["Classe 10","Classe","prof10",null,"","",null,null,"",{"$f":"IF(COUNTA(D59:D64)<=2,\"\",COUNTA(D59:D64))","v":""}]
[null,"3è10",null,null,"","",null,null,""]
[null,null,null,null,"","",null,null,""]
[null,"nbre d'élèves :   ",null,null,"","",null,null,""]
[null,null,null,null,"","",null,null,""]
[null,null,null,null,"","",null,null,""]
["Classe 11","Classe","prof11",null,"","",null,null,"",{"$f":"IF(COUNTA(D65:D70)<=2,\"\",COUNTA(D65:D70))","v":""}]
[null,"3è11",null,null,"","",null,null,""]
[null,null,null,null,"","",null,null,""]
[null,"nbre d'élèves :   ",null,null,"","",null,null,""]
[null,null,null,null,"","",null,null,""]
[null,null,null,null,"","",null,null,""]
["Classe 12","Classe","prof12",null,"","",null,null,"",{"$f":"IF(COUNTA(D71:D76)<=2,\"\",COUNTA(D71:D76))","v":""}]
[null,"3è12",null,null,"","",null,null,""]
[null,null,null,null,"","",null,null,""]
[null,"nbre d'élèves :   ",null,null,"","",null,null,""]
[null,null,null,null,"","",null,null,""]
[null,null,null,null,"","",null,null,""]
[null,null,null,null,null,null,null,null,{"$f":"IF(COUNT(I5:I76)=0,\"\",\"Attention, une ou plusieurs APSA du protocole sont mal saisies!\")","v":""},{"$f":"AVERAGE(J5:J71)","v":4}]
[null,"Date de validation par le chef d'établissement :",null,null,null,null,null,null,null,{"$f":"COUNT(J5:J71)","v":2}]
[null,"Informations à transmettre à l'inspection :"]
[]
[null,null,null,null,null,null,null,null,""]
[]
[null,"Partie reservée à l'inspection :"]

{"sheet":"9830492T","index":20,"n_rows":83,"n_cols":10,"rows_kept":83,"cut":false,"hidden":false,"merged":[[0,3,0,5],[2,1,3,1],[2,2,3,2],[2,3,3,3],[2,4,2,5],[2,7,3,7],[4,0,9,0],[4,2,9,2],[10,0,15,0],[10,2,15,2],[16,0,21,0],[16,2,21,2],[2,6,3,6],[58,0,63,0],[58,2,63,2],[22,0,27,0],[22,2,27,2],[28,0,33,0],[28,2,33,2],[34,0,39,0],[34,2,39,2],[64,0,69,0],[64,2,69,2],[70,0,75,0],[70,2,75,2],[40,0,45,0],[40,2,45,2],[46,0,51,0],[46,2,51,2],[52,0,57,0],[52,2,57,2]]}
["R","DNB 2014","9830492T","GOD KOUAOUA",null,null,"PROVINCE NORD","Académie de Nouvelle-Calédonie",{"$f":"IF(C1=\"\",\"\",VLOOKUP(C1,etab,4,FALSE))","v":"public"}]
["GEBEPS_2014_IPR_PROTOCOLES_public_9830492T.xls",null,null,null,"",null,null,null,{"$f":"Données!M11","v":"V3_29/10/13"}]
[null,"CLASSES            évaluées pour le DNB","NOM \nde l'enseignant responsable de la classe","Activités","Compétences\npropres",null,"dates des évaluations","dates des rattrapages",null,"nbre APSA\n/ classe"]
[null,null,null,null,"CP","Liste"]
["Classe 1","Classe","VILI Laurent","Javelot","CP1","N","2014-06-05","2014-06-26",{"$f":"IF(ISERROR(E5),1,\"\")","v":""},{"$f":"IF(COUNTA(D5:D10)<=2,\"\",COUNTA(D5:D10))","v":3}]
[null,"3èK",null,"Acrosport","CP3","N","2014-10-09","2014-10-30",{"$f":"IF(ISERROR(E6),1,\"\")","v":""}]
[null,null,null,"Volley","CP4","N","2014-08-07","2014-08-28",""]
[null,"nbre d'élèves :   ",null,null,"","",null,null,""]
[null,null,null,null,"","",null,null,""]
[null,null,null,null,"","",null,null,""]
["Classe 2","Classe","prof2",null,"","",null,null,"",{"$f":"IF(COUNTA(D11:D16)<=2,\"\",COUNTA(D11:D16))","v":""}]
[null,"3è2",null,null,"","",null,null,""]
[null,null,null,null,"","",null,null,""]
[null,"nbre d'élèves :   ",null,null,"","",null,null,""]
[null,null,null,null,"","",null,null,""]
[null,null,null,null,"","",null,null,""]
["Classe 3","Classe","prof3",null,"","",null,null,"",{"$f":"IF(COUNTA(D17:D22)<=2,\"\",COUNTA(D17:D22))","v":""}]
[null,"3è3",null,null,"","",null,null,""]
[null,null,null,null,"","",null,null,""]
[null,"nbre d'élèves :   ",null,null,"","",null,null,""]
[null,null,null,null,"","",null,null,""]
[null,null,null,null,"","",null,null,""]
["Classe 4","Classe","prof4",null,"","",null,null,"",{"$f":"IF(COUNTA(D23:D28)<=2,\"\",COUNTA(D23:D28))","v":""}]
[null,"3è4",null,null,"","",null,null,""]
[null,null,null,null,"","",null,null,""]
[null,"nbre d'élèves :   ",null,null,"","",null,null,""]
[null,null,null,null,"","",null,null,""]
[null,null,null,null,"","",null,null,""]
["Classe 5","Classe","prof5",null,"","",null,null,"",{"$f":"IF(COUNTA(D29:D34)<=2,\"\",COUNTA(D29:D34))","v":""}]
[null,"3è5",null,null,"","",null,null,""]
[null,null,null,null,"","",null,null,""]
[null,"nbre d'élèves :   ",null,null,"","",null,null,""]
[null,null,null,null,"","",null,null,""]
[null,null,null,null,"","",null,null,""]
["Classe 6","Classe","prof6",null,"","",null,null,"",{"$f":"IF(COUNTA(D35:D40)<=2,\"\",COUNTA(D35:D40))","v":""}]
[null,"3è6",null,null,"","",null,null,""]
[null,null,null,null,"","",null,null,""]
[null,"nbre d'élèves :   ",null,null,"","",null,null,""]
[null,null,null,null,"","",null,null,""]
[null,null,null,null,"","",null,null,""]
["Classe 7","Classe","prof7",null,"","",null,null,{"$f":"IF(ISERROR(E41),1,\"\")","v":""},{"$f":"IF(COUNTA(D41:D46)<=2,\"\",COUNTA(D41:D46))","v":""}]
[null,"3è7",null,null,"","",null,null,{"$f":"IF(ISERROR(E42),1,\"\")","v":""}]
[null,null,null,null,"","",null,null,""]
[null,"nbre d'élèves :   ",null,null,"","",null,null,""]
[null,null,null,null,"","",null,null,""]
[null,null,null,null,"","",null,null,""]
["Classe 8","Classe","prof8",null,"","",null,null,"",{"$f":"IF(COUNTA(D47:D52)<=2,\"\",COUNTA(D47:D52))","v":""}]
[null,"3è8",null,null,"","",null,null,""]
[null,null,null,null,"","",null,null,""]
[null,"nbre d'élèves :   ",null,null,"","",null,null,""]
[null,null,null,null,"","",null,null,""]
[null,null,null,null,"","",null,null,""]
["Classe 9","Classe","prof9",null,"","",null,null,"",{"$f":"IF(COUNTA(D53:D58)<=2,\"\",COUNTA(D53:D58))","v":""}]
[null,"3è9",null,null,"","",null,null,""]
[null,null,null,null,"","",null,null,""]
[null,"nbre d'élèves :   ",null,null,"","",null,null,""]
[null,null,null,null,"","",null,null,""]
[null,null,null,null,"","",null,null,""]
["Classe 10","Classe","prof10",null,"","",null,null,"",{"$f":"IF(COUNTA(D59:D64)<=2,\"\",COUNTA(D59:D64))","v":""}]
[null,"3è10",null,null,"","",null,null,""]
[null,null,null,null,"","",null,null,""]
[null,"nbre d'élèves :   ",null,null,"","",null,null,""]
[null,null,null,null,"","",null,null,""]
[null,null,null,null,"","",null,null,""]
["Classe 11","Classe","prof11",null,"","",null,null,"",{"$f":"IF(COUNTA(D65:D70)<=2,\"\",COUNTA(D65:D70))","v":""}]
[null,"3è11",null,null,"","",null,null,""]
[null,null,null,null,"","",null,null,""]
[null,"nbre d'élèves :   ",null,null,"","",null,null,""]
[null,null,null,null,"","",null,null,""]
[null,null,null,null,"","",null,null,""]
["Classe 12","Classe","prof12",null,"","",null,null,"",{"$f":"IF(COUNTA(D71:D76)<=2,\"\",COUNTA(D71:D76))","v":""}]
[null,"3è12",null,null,"","",null,null,""]
[null,null,null,null,"","",null,null,""]
[null,"nbre d'élèves :   ",null,null,"","",null,null,""]
[null,null,null,null,"","",null,null,""]
[null,null,null,null,"","",null,null,""]
[null,null,null,null,null,null,null,null,{"$f":"IF(COUNT(I5:I76)=0,\"\",\"Attention, une ou plusieurs APSA du protocole sont mal saisies!\")","v":""},{"$f":"AVERAGE(J5:J71)","v":3}]
[null,"Date de validation par le chef d'établissement :",null,null,null,null,null,null,null,{"$f":"COUNT(J5:J71)","v":1}]
[null,"Informations à transmettre à l'inspection :"]
[]
[null,null,null,null,null,null,null,null,""]
[]
[null,"Partie reservée à l'inspection :"]

{"sheet":"9830482G","index":21,"n_rows":83,"n_cols":10,"rows_kept":83,"cut":false,"hidden":false,"merged":[[64,0,69,0],[64,2,69,2],[70,0,75,0],[70,2,75,2],[28,2,33,2],[52,0,57,0],[52,2,57,2],[58,0,63,0],[58,2,63,2],[40,0,45,0],[40,2,45,2],[46,0,51,0],[46,2,51,2],[2,7,3,7],[4,0,9,0],[4,2,9,2],[10,0,15,0],[10,2,15,2],[16,0,21,0],[16,2,21,2],[2,6,3,6],[0,3,0,5],[2,1,3,1],[2,2,3,2],[2,3,3,3],[2,4,2,5],[34,0,39,0],[34,2,39,2],[22,0,27,0],[22,2,27,2],[28,0,33,0]]}
["R","DNB 2014","9830482G","CLG LA ROCHE ET SEGPA - MARE",null,null,"PROVINCE DES ILES","Académie de Nouvelle-Calédonie",{"$f":"IF(C1=\"\",\"\",VLOOKUP(C1,etab,4,FALSE))","v":"public"}]
["GEBEPS_2014_IPR_PROTOCOLES_public_9830482G.xls",null,null,null,"",null,null,null,{"$f":"Données!M11","v":"V3_29/10/13"}]
[null,"CLASSES            évaluées pour le DNB","NOM \nde l'enseignant responsable de la classe","Activités","Compétences\npropres",null,"dates des évaluations","dates des rattrapages",null,"nbre APSA\n/ classe"]
[null,null,null,null,"CP","Liste"]
["Classe 1","Classe","ICART","Foot","CP4","N","2014-05-07","2014-05-14",{"$f":"IF(ISERROR(E5),1,\"\")","v":""},{"$f":"IF(COUNTA(D5:D10)<=2,\"\",COUNTA(D5:D10))","v":4}]
[null,"3è1",null,"Demi-fond","CP1","N","2014-07-30","2014-08-01",{"$f":"IF(ISERROR(E6),1,\"\")","v":""}]
[null,null,null,"Volley","CP4","N","2014-11-05","2014-11-07",""]
[null,"nbre d'élèves :   ",null,"CO","CP2","N","2014-09-18","2014-09-26",""]
[null,24,null,null,"","",null,null,""]
[null,null,null,null,"","",null,null,""]
["Classe 2","Classe","BOUDET","Volley","CP4","N","2014-04-25","2014-04-29","",{"$f":"IF(COUNTA(D11:D16)<=2,\"\",COUNTA(D11:D16))","v":4}]
[null,"3è2",null,"Demi-fond","CP1","N","2014-07-25","2014-08-01",""]
[null,null,null,"CO","CP2","N","2014-10-31","2014-11-07",""]
[null,"nbre d'élèves :   ",null,"Basket","CP4","N","2014-09-16","2014-09-23",""]
[null,18,null,null,"","",null,null,""]
[null,null,null,null,"","",null,null,""]
["Classe 3","Classe","prof3",null,"","",null,null,"",{"$f":"IF(COUNTA(D17:D22)<=2,\"\",COUNTA(D17:D22))","v":""}]
[null,"3è3",null,null,"","",null,null,""]
[null,null,null,null,"","",null,null,""]
[null,"nbre d'élèves :   ",null,null,"","",null,null,""]
[null,null,null,null,"","",null,null,""]
[null,null,null,null,"","",null,null,""]
["Classe 4","Classe","prof4",null,"","",null,null,"",{"$f":"IF(COUNTA(D23:D28)<=2,\"\",COUNTA(D23:D28))","v":""}]
[null,"3è4",null,null,"","",null,null,""]
[null,null,null,null,"","",null,null,""]
[null,"nbre d'élèves :   ",null,null,"","",null,null,""]
[null,null,null,null,"","",null,null,""]
[null,null,null,null,"","",null,null,""]
["Classe 5","Classe","prof5",null,"","",null,null,"",{"$f":"IF(COUNTA(D29:D34)<=2,\"\",COUNTA(D29:D34))","v":""}]
[null,"3è5",null,null,"","",null,null,""]
[null,null,null,null,"","",null,null,""]
[null,"nbre d'élèves :   ",null,null,"","",null,null,""]
[null,null,null,null,"","",null,null,""]
[null,null,null,null,"","",null,null,""]
["Classe 6","Classe","prof6",null,"","",null,null,"",{"$f":"IF(COUNTA(D35:D40)<=2,\"\",COUNTA(D35:D40))","v":""}]
[null,"3è6",null,null,"","",null,null,""]
[null,null,null,null,"","",null,null,""]
[null,"nbre d'élèves :   ",null,null,"","",null,null,""]
[null,null,null,null,"","",null,null,""]
[null,null,null,null,"","",null,null,""]
["Classe 7","Classe","prof7",null,"","",null,null,{"$f":"IF(ISERROR(E41),1,\"\")","v":""},{"$f":"IF(COUNTA(D41:D46)<=2,\"\",COUNTA(D41:D46))","v":""}]
[null,"3è7",null,null,"","",null,null,{"$f":"IF(ISERROR(E42),1,\"\")","v":""}]
[null,null,null,null,"","",null,null,""]
[null,"nbre d'élèves :   ",null,null,"","",null,null,""]
[null,null,null,null,"","",null,null,""]
[null,null,null,null,"","",null,null,""]
["Classe 8","Classe","prof8",null,"","",null,null,"",{"$f":"IF(COUNTA(D47:D52)<=2,\"\",COUNTA(D47:D52))","v":""}]
[null,"3è8",null,null,"","",null,null,""]
[null,null,null,null,"","",null,null,""]
[null,"nbre d'élèves :   ",null,null,"","",null,null,""]
[null,null,null,null,"","",null,null,""]
[null,null,null,null,"","",null,null,""]
["Classe 9","Classe","prof9",null,"","",null,null,"",{"$f":"IF(COUNTA(D53:D58)<=2,\"\",COUNTA(D53:D58))","v":""}]
[null,"3è9",null,null,"","",null,null,""]
[null,null,null,null,"","",null,null,""]
[null,"nbre d'élèves :   ",null,null,"","",null,null,""]
[null,null,null,null,"","",null,null,""]
[null,null,null,null,"","",null,null,""]
["Classe 10","Classe","prof10",null,"","",null,null,"",{"$f":"IF(COUNTA(D59:D64)<=2,\"\",COUNTA(D59:D64))","v":""}]
[null,"3è10",null,null,"","",null,null,""]
[null,null,null,null,"","",null,null,""]
[null,"nbre d'élèves :   ",null,null,"","",null,null,""]
[null,null,null,null,"","",null,null,""]
[null,null,null,null,"","",null,null,""]
["Classe 11","Classe","prof11",null,"","",null,null,"",{"$f":"IF(COUNTA(D65:D70)<=2,\"\",COUNTA(D65:D70))","v":""}]
[null,"3è11",null,null,"","",null,null,""]
[null,null,null,null,"","",null,null,""]
[null,"nbre d'élèves :   ",null,null,"","",null,null,""]
[null,null,null,null,"","",null,null,""]
[null,null,null,null,"","",null,null,""]
["Classe 12","Classe","prof12",null,"","",null,null,"",{"$f":"IF(COUNTA(D71:D76)<=2,\"\",COUNTA(D71:D76))","v":""}]
[null,"3è12",null,null,"","",null,null,""]
[null,null,null,null,"","",null,null,""]
[null,"nbre d'élèves :   ",null,null,"","",null,null,""]
[null,null,null,null,"","",null,null,""]
[null,null,null,null,"","",null,null,""]
[null,null,null,null,null,null,null,null,{"$f":"IF(COUNT(I5:I76)=0,\"\",\"Attention, une ou plusieurs APSA du protocole sont mal saisies!\")","v":""},{"$f":"AVERAGE(J5:J71)","v":4}]
[null,"Date de validation par le chef d'établissement :",null,null,null,null,null,null,null,{"$f":"COUNT(J5:J71)","v":2}]
[null,"Informations à transmettre à l'inspection :"]
[]
[null,null,null,null,null,null,null,null,""]
[]
[null,"Partie reservée à l'inspection :"]

{"sheet":"9830477B","index":22,"n_rows":83,"n_cols":10,"rows_kept":83,"cut":false,"hidden":false,"merged":[[0,3,0,5],[2,1,3,1],[2,2,3,2],[2,3,3,3],[2,4,2,5],[2,7,3,7],[4,0,9,0],[4,2,9,2],[10,0,15,0],[10,2,15,2],[16,0,21,0],[16,2,21,2],[2,6,3,6],[58,0,63,0],[58,2,63,2],[22,0,27,0],[22,2,27,2],[28,0,33,0],[28,2,33,2],[34,0,39,0],[34,2,39,2],[64,0,69,0],[64,2,69,2],[70,0,75,0],[70,2,75,2],[40,0,45,0],[40,2,45,2],[46,0,51,0],[46,2,51,2],[52,0,57,0],[52,2,57,2]]}
["R","DNB 2014","9830477B","CLG DE YATE",null,null,"PROVINCE SUD","Académie de Nouvelle-Calédonie",{"$f":"IF(C1=\"\",\"\",VLOOKUP(C1,etab,4,FALSE))","v":"public"}]
["GEBEPS_2014_IPR_PROTOCOLES_public_9830477B.xls",null,null,null,"",null,null,null,{"$f":"Données!M11","v":"V3_29/10/13"}]
[null,"CLASSES            évaluées pour le DNB","NOM \nde l'enseignant responsable de la classe","Activités","Compétences\npropres",null,"dates des évaluations","dates des rattrapages",null,"nbre APSA\n/ classe"]
[null,null,null,null,"CP","Liste"]
["Classe 1","Classe","HOUSSART","Acrosport","CP3","N","2014-04-30","2014-05-07",{"$f":"IF(ISERROR(E5),1,\"\")","v":""},{"$f":"IF(COUNTA(D5:D10)<=2,\"\",COUNTA(D5:D10))","v":3}]
[null,"3A",null,"Javelot","CP1","N","2014-07-16","2014-07-23",{"$f":"IF(ISERROR(E6),1,\"\")","v":""}]
[null,null,null,"Badminton","CP4","N","2014-10-01","2014-10-08",""]
[null,"nbre d'élèves :   ",null,null,"","",null,null,""]
[null,15,null,null,"","",null,null,""]
[null,null,null,null,"","",null,null,""]
["Classe 2","Classe","HOUSSART","Acrosport","CP3","N","2014-04-30","2014-05-07","",{"$f":"IF(COUNTA(D11:D16)<=2,\"\",COUNTA(D11:D16))","v":3}]
[null,"3PDMF",null,"Javelot","CP1","N","2014-07-16","2014-07-23",""]
[null,null,null,"Badminton","CP4","N","2014-10-01","2014-10-08",""]
[null,"nbre d'élèves :   ",null,null,"","",null,null,""]
[null,11,null,null,"","",null,null,""]
[null,null,null,null,"","",null,null,""]
["Classe 3","Classe","prof3",null,"","",null,null,"",{"$f":"IF(COUNTA(D17:D22)<=2,\"\",COUNTA(D17:D22))","v":""}]
[null," ",null,null,"","",null,null,""]
[null,null,null,null,"","",null,null,""]
[null,"nbre d'élèves :   ",null,null,"","",null,null,""]
[null,null,null,null,"","",null,null,""]
[null,null,null,null,"","",null,null,""]
["Classe 4","Classe","prof4",null,"","",null,null,"",{"$f":"IF(COUNTA(D23:D28)<=2,\"\",COUNTA(D23:D28))","v":""}]
[null," ",null,null,"","",null,null,""]
[null,null,null,null,"","",null,null,""]
[null,"nbre d'élèves :   ",null,null,"","",null,null,""]
[null,null,null,null,"","",null,null,""]
[null,null,null,null,"","",null,null,""]
["Classe 5","Classe","prof5",null,"","",null,null,"",{"$f":"IF(COUNTA(D29:D34)<=2,\"\",COUNTA(D29:D34))","v":""}]
[null," ",null,null,"","",null,null,""]
[null,null,null,null,"","",null,null,""]
[null,"nbre d'élèves :   ",null,null,"","",null,null,""]
[null,null,null,null,"","",null,null,""]
[null,null,null,null,"","",null,null,""]
["Classe 6","Classe","prof6",null,"","",null,null,"",{"$f":"IF(COUNTA(D35:D40)<=2,\"\",COUNTA(D35:D40))","v":""}]
[null," ",null,null,"","",null,null,""]
[null,null,null,null,"","",null,null,""]
[null,"nbre d'élèves :   ",null,null,"","",null,null,""]
[null,null,null,null,"","",null,null,""]
[null,null,null,null,"","",null,null,""]
["Classe 7","Classe","prof7",null,"","",null,null,{"$f":"IF(ISERROR(E41),1,\"\")","v":""},{"$f":"IF(COUNTA(D41:D46)<=2,\"\",COUNTA(D41:D46))","v":""}]
[null," ",null,null,"","",null,null,{"$f":"IF(ISERROR(E42),1,\"\")","v":""}]
[null,null,null,null,"","",null,null,""]
[null,"nbre d'élèves :   ",null,null,"","",null,null,""]
[null,null,null,null,"","",null,null,""]
[null,null,null,null,"","",null,null,""]
["Classe 8","Classe","prof8",null,"","",null,null,"",{"$f":"IF(COUNTA(D47:D52)<=2,\"\",COUNTA(D47:D52))","v":""}]
[null," ",null,null,"","",null,null,""]
[null,null,null,null,"","",null,null,""]
[null,"nbre d'élèves :   ",null,null,"","",null,null,""]
[null,null,null,null,"","",null,null,""]
[null,null,null,null,"","",null,null,""]
["Classe 9","Classe","prof9",null,"","",null,null,"",{"$f":"IF(COUNTA(D53:D58)<=2,\"\",COUNTA(D53:D58))","v":""}]
[null," ",null,null,"","",null,null,""]
[null,null,null,null,"","",null,null,""]
[null,"nbre d'élèves :   ",null,null,"","",null,null,""]
[null,null,null,null,"","",null,null,""]
[null,null,null,null,"","",null,null,""]
["Classe 10","Classe","prof10",null,"","",null,null,"",{"$f":"IF(COUNTA(D59:D64)<=2,\"\",COUNTA(D59:D64))","v":""}]
[null," ",null,null,"","",null,null,""]
[null,null,null,null,"","",null,null,""]
[null,"nbre d'élèves :   ",null,null,"","",null,null,""]
[null,null,null,null,"","",null,null,""]
[null,null,null,null,"","",null,null,""]
["Classe 11","Classe","prof11",null,"","",null,null,"",{"$f":"IF(COUNTA(D65:D70)<=2,\"\",COUNTA(D65:D70))","v":""}]
[null," ",null,null,"","",null,null,""]
[null,null,null,null,"","",null,null,""]
[null,"nbre d'élèves :   ",null,null,"","",null,null,""]
[null,null,null,null,"","",null,null,""]
[null,null,null,null,"","",null,null,""]
["Classe 12","Classe","prof12",null,"","",null,null,"",{"$f":"IF(COUNTA(D71:D76)<=2,\"\",COUNTA(D71:D76))","v":""}]
[null," ",null,null,"","",null,null,""]
[null,null,null,null,"","",null,null,""]
[null,"nbre d'élèves :   ",null,null,"","",null,null,""]
[null,null,null,null,"","",null,null,""]
[null,null,null,null,"","",null,null,""]
[null,null,null,null,null,null,null,null,{"$f":"IF(COUNT(I5:I76)=0,\"\",\"Attention, une ou plusieurs APSA du protocole sont mal saisies!\")","v":""},{"$f":"AVERAGE(J5:J71)","v":3}]
[null,"Date de validation par le chef d'établissement :",null,null,null,null,null,null,null,{"$f":"COUNT(J5:J71)","v":2}]
[null,"Informations à transmettre à l'inspection :"]
[]
[null,null,null,null,null,null,null,null,""]
[]
[null,"Partie reservée à l'inspection :"]

{"sheet":"9830474Y","index":23,"n_rows":83,"n_cols":10,"rows_kept":83,"cut":false,"hidden":false,"merged":[[64,0,69,0],[64,2,69,2],[70,0,75,0],[70,2,75,2],[46,0,51,0],[46,2,51,2],[52,0,57,0],[52,2,57,2],[58,0,63,0],[58,2,63,2],[22,0,27,0],[22,2,27,2],[28,0,33,0],[28,2,33,2],[34,0,39,0],[34,2,39,2],[40,0,45,0],[40,2,45,2],[4,0,9,0],[4,2,9,2],[10,0,15,0],[10,2,15,2],[16,0,21,0],[16,2,21,2],[0,3,0,5],[2,1,3,1],[2,2,3,2],[2,3,3,3],[2,4,2,5],[2,7,3,7],[2,6,3,6]]}
["R","DNB 2014","9830474Y","CLG FRANCIS CARCO ET SEGPA - KOUTIO",null,null,"PROVINCE SUD","Académie de Nouvelle-Calédonie",{"$f":"IF(C1=\"\",\"\",VLOOKUP(C1,etab,4,FALSE))","v":"public"}]
["GEBEPS_2014_IPR_PROTOCOLES_public_9830474Y.xls",null,null,null,"",null,null,null,{"$f":"Données!M11","v":"V3_29/10/13"}]
[null,"CLASSES            évaluées pour le DNB","NOM \nde l'enseignant responsable de la classe","Activités","Compétences\npropres",null,"dates des évaluations","dates des rattrapages",null,"nbre APSA\n/ classe"]
[null,null,null,null,"CP","Liste"]
["Classe 1","Classe","COURTINE","Hand","CP4","N","2014-05-06","2014-11-05",{"$f":"IF(ISERROR(E5),1,\"\")","v":""},{"$f":"IF(COUNTA(D5:D10)<=2,\"\",COUNTA(D5:D10))","v":4}]
[null,"3è1",null,"Demi-fond","CP1","N","2014-07-29","2014-11-05",{"$f":"IF(ISERROR(E6),1,\"\")","v":""}]
[null,null,null,"Acrosport","CP3","N","2014-07-31","2014-11-04",""]
[null,"nbre d'élèves :   ",null,"Badminton","CP4","N","2014-10-30","2014-11-05",""]
[null,25,null,null,"","",null,null,""]
[null,null,null,null,"","",null,null,""]
["Classe 2","Classe","LINCKER","Hand","CP4","N","2014-04-29","2014-11-05","",{"$f":"IF(COUNTA(D11:D16)<=2,\"\",COUNTA(D11:D16))","v":4}]
[null,"3è2",null,"Demi-fond","CP1","N","2014-07-31","2014-11-05",""]
[null,null,null,"Badminton","CP4","N","2014-07-29","2014-11-05",""]
[null,"nbre d'élèves :   ",null,"Acrosport","CP3","N","2014-10-28","2014-11-04",""]
[null,25,null,null,"","",null,null,""]
[null,null,null,null,"","",null,null,""]
["Classe 3","Classe","BRIANCON","Demi-fond","CP1","N","2014-07-29","2014-11-05","",{"$f":"IF(COUNTA(D17:D22)<=2,\"\",COUNTA(D17:D22))","v":3}]
[null,"3è3",null,"Acrosport","CP3","N","2014-08-01","2014-11-04",""]
[null,null,null,"Hand","CP4","N","2014-10-31","2014-11-05",""]
[null,"nbre d'élèves :   ",null,null,"","",null,null,""]
[null,25,null,null,"","",null,null,""]
[null,null,null,null,"","",null,null,""]
["Classe 4","Classe","DUPONT","Demi-fond","CP1","N","2014-07-29","2014-11-05","",{"$f":"IF(COUNTA(D23:D28)<=2,\"\",COUNTA(D23:D28))","v":3}]
[null,"3è4",null,"Acrosport","CP3","N","2014-08-01","2014-11-04",""]
[null,null,null,"Hand","CP4","N","2014-10-31","2014-11-05",""]
[null,"nbre d'élèves :   ",null,null,"","",null,null,""]
[null,24,null,null,"","",null,null,""]
[null,null,null,null,"","",null,null,""]
["Classe 5","Classe","BRIANCON","Demi-fond","CP1","N","2014-07-30","2014-11-05","",{"$f":"IF(COUNTA(D29:D34)<=2,\"\",COUNTA(D29:D34))","v":3}]
[null,"3è5",null,"Acrosport","CP3","N","2014-10-27","2014-11-04",""]
[null,null,null,"Badminton","CP4","N","2014-07-28","2014-11-05",""]
[null,"nbre d'élèves :   ",null,null,"","",null,null,""]
[null,25,null,null,"","",null,null,""]
[null,null,null,null,"","",null,null,""]
["Classe 6","Classe","LINCKER","Badminton","CP4","N","2014-05-07","2014-11-05","",{"$f":"IF(COUNTA(D35:D40)<=2,\"\",COUNTA(D35:D40))","v":4}]
[null,"3è6",null,"Demi-fond","CP1","N","2014-08-01","2014-11-05",""]
[null,null,null,"Acrosport","CP3","N","2014-10-29","2014-11-04",""]
[null,"nbre d'élèves :   ",null,"Hand","CP4","N","2014-07-30","2014-11-05",""]
[null,24,null,null,"","",null,null,""]
[null,null,null,null,"","",null,null,""]
["Classe 7","Classe","HUGUES","Demi-fond","CP1","N","2014-08-01","2014-11-05",{"$f":"IF(ISERROR(E41),1,\"\")","v":""},{"$f":"IF(COUNTA(D41:D46)<=2,\"\",COUNTA(D41:D46))","v":3}]
[null,"3è7",null,"Danse","CP3","N","2014-05-07","2014-11-04",{"$f":"IF(ISERROR(E42),1,\"\")","v":""}]
[null,null,null,"Badminton","CP4","N","2014-07-30","2014-11-05",""]
[null,"nbre d'élèves :   ",null,null,"","",null,null,""]
[null,25,null,null,"","",null,null,""]
[null,null,null,null,"","",null,null,""]
["Classe 8","Classe","VASAPOLLI","Demi-fond","CP1","N","2014-07-28","2014-11-05","",{"$f":"IF(COUNTA(D47:D52)<=2,\"\",COUNTA(D47:D52))","v":3}]
[null,"3è8",null,"Acrosport","CP3","N","2014-07-31","2014-11-04",""]
[null,null,null,"Hand","CP4","N","2014-10-30","2014-11-05",""]
[null,"nbre d'élèves :   ",null,null,"","",null,null,""]
[null,19,null,null,"","",null,null,""]
[null,null,null,null,"","",null,null,""]
["Classe 9","Classe","prof9",null,"","",null,null,"",{"$f":"IF(COUNTA(D53:D58)<=2,\"\",COUNTA(D53:D58))","v":""}]
[null,"3è9",null,null,"","",null,null,""]
[null,null,null,null,"","",null,null,""]
[null,"nbre d'élèves :   ",null,null,"","",null,null,""]
[null,null,null,null,"","",null,null,""]
[null,null,null,null,"","",null,null,""]
["Classe 10","Classe","prof10",null,"","",null,null,"",{"$f":"IF(COUNTA(D59:D64)<=2,\"\",COUNTA(D59:D64))","v":""}]
[null,"3è10",null,null,"","",null,null,""]
[null,null,null,null,"","",null,null,""]
[null,"nbre d'élèves :   ",null,null,"","",null,null,""]
[null,null,null,null,"","",null,null,""]
[null,null,null,null,"","",null,null,""]
["Classe 11","Classe","prof11",null,"","",null,null,"",{"$f":"IF(COUNTA(D65:D70)<=2,\"\",COUNTA(D65:D70))","v":""}]
[null,"3è11",null,null,"","",null,null,""]
[null,null,null,null,"","",null,null,""]
[null,"nbre d'élèves :   ",null,null,"","",null,null,""]
[null,null,null,null,"","",null,null,""]
[null,null,null,null,"","",null,null,""]
["Classe 12","Classe","prof12",null,"","",null,null,"",{"$f":"IF(COUNTA(D71:D76)<=2,\"\",COUNTA(D71:D76))","v":""}]
[null,"3è12",null,null,"","",null,null,""]
[null,null,null,null,"","",null,null,""]
[null,"nbre d'élèves :   ",null,null,"","",null,null,""]
[null,null,null,null,"","",null,null,""]
[null,null,null,null,"","",null,null,""]
[null,null,null,null,null,null,null,null,{"$f":"IF(COUNT(I5:I76)=0,\"\",\"Attention, une ou plusieurs APSA du protocole sont mal saisies!\")","v":""},{"$f":"AVERAGE(J5:J71)","v":3.375}]
[null,"Date de validation par le chef d'établissement :",null,null,null,null,null,null,null,{"$f":"COUNT(J5:J71)","v":8}]
[null,"Informations à transmettre à l'inspection :"]
[]
[null,null,null,null,null,null,null,null,""]
[]
[null,"Partie reservée à l'inspection :"]

{"sheet":"9830419n","index":24,"n_rows":83,"n_cols":10,"rows_kept":83,"cut":false,"hidden":false,"merged":[[64,0,69,0],[64,2,69,2],[70,0,75,0],[70,2,75,2],[46,0,51,0],[46,2,51,2],[52,0,57,0],[52,2,57,2],[58,0,63,0],[58,2,63,2],[22,0,27,0],[22,2,27,2],[28,0,33,0],[28,2,33,2],[34,0,39,0],[34,2,39,2],[40,0,45,0],[40,2,45,2],[4,0,9,0],[4,2,9,2],[10,0,15,0],[10,2,15,2],[16,0,21,0],[16,2,21,2],[0,3,0,5],[2,1,3,1],[2,2,3,2],[2,3,3,3],[2,4,2,5],[2,7,3,7],[2,6,3,6]]}
["R","DNB 2014","9830419n","CLG DE CANALA ET SEGPA",null,null,"PROVINCE NORD","Académie de Nouvelle-Calédonie",{"$f":"IF(C1=\"\",\"\",VLOOKUP(C1,etab,4,FALSE))","v":"public"}]
["GEBEPS_2014_IPR_PROTOCOLES_public_9830419n.xls",null,null,null,"",null,null,null,{"$f":"Données!M11","v":"V3_29/10/13"}]
[null,"CLASSES            évaluées pour le DNB","NOM \nde l'enseignant responsable de la classe","Activités","Compétences\npropres",null,"dates des évaluations","dates des rattrapages",null,"nbre APSA\n/ classe"]
[null,null,null,null,"CP","Liste"]
["Classe 1","Classe","SUDRES André","Javelot","CP1","N","2014-10-01","2014-10-07",{"$f":"IF(ISERROR(E5),1,\"\")","v":""},{"$f":"IF(COUNTA(D5:D10)<=2,\"\",COUNTA(D5:D10))","v":3}]
[null,"3èA",null,"Acrosport","CP3","N","2014-09-16","2014-09-18",{"$f":"IF(ISERROR(E6),1,\"\")","v":""}]
[null,null,null,"Badminton","CP4","N","30/0414","07/0514",""]
[null,"nbre d'élèves :   ",null,null,"","",null,null,""]
[null,null,null,null,"","",null,null,""]
[null,null,null,null,"","",null,null,""]
["Classe 2","Classe","ROBIN David","Javelot","CP1","N","2014-06-04","2014-06-25","",{"$f":"IF(COUNTA(D11:D16)<=2,\"\",COUNTA(D11:D16))","v":3}]
[null,"3èB",null,"Acrosport","CP3","N","2014-10-09","2014-10-28",""]
[null,null,null,"Badminton","CP4","N","2014-05-22","05/0614",""]
[null,"nbre d'élèves :   ",null,null,"","",null,null,""]
[null,null,null,null,"","",null,null,""]
[null,null,null,null,"","",null,null,""]
["Classe 3","Classe","prof3",null,"","",null,null,"",{"$f":"IF(COUNTA(D17:D22)<=2,\"\",COUNTA(D17:D22))","v":""}]
[null,"3è3",null,null,"","",null,null,""]
[null,null,null,null,"","",null,null,""]
[null,"nbre d'élèves :   ",null,null,"","",null,null,""]
[null,null,null,null,"","",null,null,""]
[null,null,null,null,"","",null,null,""]
["Classe 4","Classe","prof4",null,"","",null,null,"",{"$f":"IF(COUNTA(D23:D28)<=2,\"\",COUNTA(D23:D28))","v":""}]
[null,"3è4",null,null,"","",null,null,""]
[null,null,null,null,"","",null,null,""]
[null,"nbre d'élèves :   ",null,null,"","",null,null,""]
[null,null,null,null,"","",null,null,""]
[null,null,null,null,"","",null,null,""]
["Classe 5","Classe","prof5",null,"","",null,null,"",{"$f":"IF(COUNTA(D29:D34)<=2,\"\",COUNTA(D29:D34))","v":""}]
[null,"3è5",null,null,"","",null,null,""]
[null,null,null,null,"","",null,null,""]
[null,"nbre d'élèves :   ",null,null,"","",null,null,""]
[null,null,null,null,"","",null,null,""]
[null,null,null,null,"","",null,null,""]
["Classe 6","Classe","prof6",null,"","",null,null,"",{"$f":"IF(COUNTA(D35:D40)<=2,\"\",COUNTA(D35:D40))","v":""}]
[null,"3è6",null,null,"","",null,null,""]
[null,null,null,null,"","",null,null,""]
[null,"nbre d'élèves :   ",null,null,"","",null,null,""]
[null,null,null,null,"","",null,null,""]
[null,null,null,null,"","",null,null,""]
["Classe 7","Classe","prof7",null,"","",null,null,{"$f":"IF(ISERROR(E41),1,\"\")","v":""},{"$f":"IF(COUNTA(D41:D46)<=2,\"\",COUNTA(D41:D46))","v":""}]
[null,"3è7",null,null,"","",null,null,{"$f":"IF(ISERROR(E42),1,\"\")","v":""}]
[null,null,null,null,"","",null,null,""]
[null,"nbre d'élèves :   ",null,null,"","",null,null,""]
[null,null,null,null,"","",null,null,""]
[null,null,null,null,"","",null,null,""]
["Classe 8","Classe","prof8",null,"","",null,null,"",{"$f":"IF(COUNTA(D47:D52)<=2,\"\",COUNTA(D47:D52))","v":""}]
[null,"3è8",null,null,"","",null,null,""]
[null,null,null,null,"","",null,null,""]
[null,"nbre d'élèves :   ",null,null,"","",null,null,""]
[null,null,null,null,"","",null,null,""]
[null,null,null,null,"","",null,null,""]
["Classe 9","Classe","prof9",null,"","",null,null,"",{"$f":"IF(COUNTA(D53:D58)<=2,\"\",COUNTA(D53:D58))","v":""}]
[null,"3è9",null,null,"","",null,null,""]
[null,null,null,null,"","",null,null,""]
[null,"nbre d'élèves :   ",null,null,"","",null,null,""]
[null,null,null,null,"","",null,null,""]
[null,null,null,null,"","",null,null,""]
["Classe 10","Classe","prof10",null,"","",null,null,"",{"$f":"IF(COUNTA(D59:D64)<=2,\"\",COUNTA(D59:D64))","v":""}]
[null,"3è10",null,null,"","",null,null,""]
[null,null,null,null,"","",null,null,""]
[null,"nbre d'élèves :   ",null,null,"","",null,null,""]
[null,null,null,null,"","",null,null,""]
[null,null,null,null,"","",null,null,""]
["Classe 11","Classe","prof11",null,"","",null,null,"",{"$f":"IF(COUNTA(D65:D70)<=2,\"\",COUNTA(D65:D70))","v":""}]
[null,"3è11",null,null,"","",null,null,""]
[null,null,null,null,"","",null,null,""]
[null,"nbre d'élèves :   ",null,null,"","",null,null,""]
[null,null,null,null,"","",null,null,""]
[null,null,null,null,"","",null,null,""]
["Classe 12","Classe","prof12",null,"","",null,null,"",{"$f":"IF(COUNTA(D71:D76)<=2,\"\",COUNTA(D71:D76))","v":""}]
[null,"3è12",null,null,"","",null,null,""]
[null,null,null,null,"","",null,null,""]
[null,"nbre d'élèves :   ",null,null,"","",null,null,""]
[null,null,null,null,"","",null,null,""]
[null,null,null,null,"","",null,null,""]
[null,null,null,null,null,null,null,null,{"$f":"IF(COUNT(I5:I76)=0,\"\",\"Attention, une ou plusieurs APSA du protocole sont mal saisies!\")","v":""},{"$f":"AVERAGE(J5:J71)","v":3}]
[null,"Date de validation par le chef d'établissement :",null,null,null,null,null,null,null,{"$f":"COUNT(J5:J71)","v":2}]
[null,"Informations à transmettre à l'inspection :"]
[]
[null,null,null,null,null,null,null,null,""]
[]
[null,"Partie reservée à l'inspection :"]

{"sheet":"9830418M","index":25,"n_rows":83,"n_cols":10,"rows_kept":83,"cut":false,"hidden":false,"merged":[[2,6,3,6],[2,7,3,7],[4,0,9,0],[4,2,9,2],[0,3,0,5],[2,1,3,1],[2,2,3,2],[2,3,3,3],[2,4,2,5],[22,0,27,0],[22,2,27,2],[28,0,33,0],[28,2,33,2],[10,0,15,0],[10,2,15,2],[16,0,21,0],[16,2,21,2],[46,0,51,0],[46,2,51,2],[52,0,57,0],[52,2,57,2],[34,0,39,0],[34,2,39,2],[40,0,45,0],[40,2,45,2],[70,0,75,0],[70,2,75,2],[58,0,63,0],[58,2,63,2],[64,0,69,0],[64,2,69,2]]}
["R","DNB 2014","9830418M","CLG DE WANI ET SEGPA - HOUAILOU",null,null,"PROVINCE NORD","Académie de Nouvelle-Calédonie",{"$f":"IF(C1=\"\",\"\",VLOOKUP(C1,etab,4,FALSE))","v":"public"}]
["GEBEPS_2014_IPR_PROTOCOLES_public_9830418M.xls",null,null,null,"",null,null,null,{"$f":"Données!M11","v":"V3_29/10/13"}]
[null,"CLASSES            évaluées pour le DNB","NOM \nde l'enseignant responsable de la classe","Activités","Compétences\npropres",null,"dates des évaluations","dates des rattrapages",null,"nbre APSA\n/ classe"]
[null,null,null,null,"CP","Liste"]
["Classe 1","Classe","KAVIVIORO Jean-Jacques","JAVELOT","CP1","N","2014-04-28","2014-05-05",{"$f":"IF(ISERROR(E5),1,\"\")","v":""},{"$f":"IF(COUNTA(D5:D10)<=2,\"\",COUNTA(D5:D10))","v":3}]
[null,"3èA",null,"Acrosport","CP3","N","2014-07-21","2014-07-28",{"$f":"IF(ISERROR(E6),1,\"\")","v":""}]
[null,null,null,"Foot","CP4","N","2014-07-22","2014-07-29",""]
[null,"nbre d'élèves :   ",null,null,"","",null,null,""]
[null,14,null,null,"","",null,null,""]
[null,null,null,null,"","",null,null,""]
["Classe 2","Classe","KAVIVIORO Jean-Jacques","Javelot","CP1","N","2014-04-29","2014-05-06","",{"$f":"IF(COUNTA(D11:D16)<=2,\"\",COUNTA(D11:D16))","v":3}]
[null,"3èB",null,"Acrosport","CP3","N","2014-07-22","2014-07-29",""]
[null,null,null,"Foot","CP4","N","2014-07-25","2014-08-01",""]
[null,"nbre d'élèves :   ",null,null,"","",null,null,""]
[null,16,null,null,"","",null,null,""]
[null,null,null,null,"","",null,null,""]
["Classe 3","Classe","BLANCHET   Benoît","Gymnastique sportive","CP3","N","2014-07-16","2014-07-23","",{"$f":"IF(COUNTA(D17:D22)<=2,\"\",COUNTA(D17:D22))","v":3}]
[null,"3èPDMF",null,"Badminton","CP4","N","22/0714","2014-07-29",""]
[null,null,null,"Javelot","CP1","N","2014-09-30","2014-10-07",""]
[null,"nbre d'élèves :   ",null,null,"","",null,null,""]
[null,10,null,null,"","",null,null,""]
[null,null,null,null,"","",null,null,""]
["Classe 4","Classe",null,null,"","",null,null,"",{"$f":"IF(COUNTA(D23:D28)<=2,\"\",COUNTA(D23:D28))","v":""}]
[null,null,null,null,"","",null,null,""]
[null,null,null,null,"","",null,null,""]
[null,"nbre d'élèves :   ",null,null,"","",null,null,""]
[null,null,null,null,"","",null,null,""]
[null,null,null,null,"","",null,null,""]
["Classe 5","Classe",null,null,"","",null,null,"",{"$f":"IF(COUNTA(D29:D34)<=2,\"\",COUNTA(D29:D34))","v":""}]
[null,null,null,null,"","",null,null,""]
[null,null,null,null,"","",null,null,""]
[null,"nbre d'élèves :   ",null,null,"","",null,null,""]
[null,null,null,null,"","",null,null,""]
[null,null,null,null,"","",null,null,""]
["Classe 6","Classe",null,null,"","",null,null,"",{"$f":"IF(COUNTA(D35:D40)<=2,\"\",COUNTA(D35:D40))","v":""}]
[null,null,null,null,"","",null,null,""]
[null,null,null,null,"","",null,null,""]
[null,"nbre d'élèves :   ",null,null,"","",null,null,""]
[null,null,null,null,"","",null,null,""]
[null,null,null,null,"","",null,null,""]
["Classe 7","Classe",null,null,"","",null,null,{"$f":"IF(ISERROR(E41),1,\"\")","v":""},{"$f":"IF(COUNTA(D41:D46)<=2,\"\",COUNTA(D41:D46))","v":""}]
[null,null,null,null,"","",null,null,{"$f":"IF(ISERROR(E42),1,\"\")","v":""}]
[null,null,null,null,"","",null,null,""]
[null,"nbre d'élèves :   ",null,null,"","",null,null,""]
[null,null,null,null,"","",null,null,""]
[null,null,null,null,"","",null,null,""]
["Classe 8","Classe","prof8",null,"","",null,null,"",{"$f":"IF(COUNTA(D47:D52)<=2,\"\",COUNTA(D47:D52))","v":""}]
[null,"3è8",null,null,"","",null,null,""]
[null,null,null,null,"","",null,null,""]
[null,"nbre d'élèves :   ",null,null,"","",null,null,""]
[null,null,null,null,"","",null,null,""]
[null,null,null,null,"","",null,null,""]
["Classe 9","Classe","prof9",null,"","",null,null,"",{"$f":"IF(COUNTA(D53:D58)<=2,\"\",COUNTA(D53:D58))","v":""}]
[null,"3è9",null,null,"","",null,null,""]
[null,null,null,null,"","",null,null,""]
[null,"nbre d'élèves :   ",null,null,"","",null,null,""]
[null,null,null,null,"","",null,null,""]
[null,null,null,null,"","",null,null,""]
["Classe 10","Classe","prof10",null,"","",null,null,"",{"$f":"IF(COUNTA(D59:D64)<=2,\"\",COUNTA(D59:D64))","v":""}]
[null,"3è10",null,null,"","",null,null,""]
[null,null,null,null,"","",null,null,""]
[null,"nbre d'élèves :   ",null,null,"","",null,null,""]
[null,null,null,null,"","",null,null,""]
[null,null,null,null,"","",null,null,""]
["Classe 11","Classe","prof11",null,"","",null,null,"",{"$f":"IF(COUNTA(D65:D70)<=2,\"\",COUNTA(D65:D70))","v":""}]
[null,"3è11",null,null,"","",null,null,""]
[null,null,null,null,"","",null,null,""]
[null,"nbre d'élèves :   ",null,null,"","",null,null,""]
[null,null,null,null,"","",null,null,""]
[null,null,null,null,"","",null,null,""]
["Classe 12","Classe","prof12",null,"","",null,null,"",{"$f":"IF(COUNTA(D71:D76)<=2,\"\",COUNTA(D71:D76))","v":""}]
[null,"3è12",null,null,"","",null,null,""]
[null,null,null,null,"","",null,null,""]
[null,"nbre d'élèves :   ",null,null,"","",null,null,""]
[null,null,null,null,"","",null,null,""]
[null,null,null,null,"","",null,null,""]
[null,null,null,null,null,null,null,null,{"$f":"IF(COUNT(I5:I76)=0,\"\",\"Attention, une ou plusieurs APSA du protocole sont mal saisies!\")","v":""},{"$f":"AVERAGE(J5:J71)","v":3}]
[null,"Date de validation par le chef d'établissement :",null,null,null,null,null,null,null,{"$f":"COUNT(J5:J71)","v":3}]
[null,"Informations à transmettre à l'inspection :"]
[]
[null,null,null,null,null,null,null,null,""]
[]
[null,"Partie reservée à l'inspection :"]

{"sheet":"9830414H","index":26,"n_rows":83,"n_cols":10,"rows_kept":83,"cut":false,"hidden":false,"merged":[[0,3,0,5],[2,1,3,1],[2,2,3,2],[2,3,3,3],[2,4,2,5],[2,7,3,7],[4,0,9,0],[4,2,9,2],[10,0,15,0],[10,2,15,2],[16,0,21,0],[16,2,21,2],[2,6,3,6],[58,0,63,0],[58,2,63,2],[22,0,27,0],[22,2,27,2],[28,0,33,0],[28,2,33,2],[34,0,39,0],[34,2,39,2],[64,0,69,0],[64,2,69,2],[70,0,75,0],[70,2,75,2],[40,0,45,0],[40,2,45,2],[46,0,51,0],[46,2,51,2],[52,0,57,0],[52,2,57,2]]}
["R","DNB 2014","9830414H","CLG TADINE - MARE",null,null,"PROVINCE DES ILES","Académie de Nouvelle-Calédonie",{"$f":"IF(C1=\"\",\"\",VLOOKUP(C1,etab,4,FALSE))","v":"public"}]
["GEBEPS_2014_IPR_PROTOCOLES_public_9830414H.xls",null,null,null,"",null,null,null,{"$f":"Données!M11","v":"V3_29/10/13"}]
[null,"CLASSES            évaluées pour le DNB","NOM \nde l'enseignant responsable de la classe","Activités","Compétences\npropres",null,"dates des évaluations","dates des rattrapages",null,"nbre APSA\n/ classe"]
[null,null,null,null,"CP","Liste"]
["Classe 1","Classe","M.DAVID J","Javelot","CP1","N","2014-04-28","2014-05-05",{"$f":"IF(ISERROR(E5),1,\"\")","v":""},{"$f":"IF(COUNTA(D5:D10)<=2,\"\",COUNTA(D5:D10))","v":3}]
[null,"3è1",null,"CO","CP2","N","2014-10-27","2014-11-03",{"$f":"IF(ISERROR(E6),1,\"\")","v":""}]
[null,null,null,"Volley","CP4","N","2014-07-21","2014-07-28",""]
[null,"nbre d'élèves :   ",null,null,"","",null,null,""]
[null,21,null,null,"","",null,null,""]
[null,null,null,null,"","",null,null,""]
["Classe 2","Classe","Mme BOUDET B","Demi-fond","CP1","N","2014-07-25","01:08:00","",{"$f":"IF(COUNTA(D11:D16)<=2,\"\",COUNTA(D11:D16))","v":3}]
[null,"3è2",null,"CO","CP2","N","2014-10-27","2014-11-03",""]
[null,null,null,"Volley","CP4","N","2014-04-28","2014-05-05",""]
[null,"nbre d'élèves :   ",null,null,"","",null,null,""]
[null,20,null,null,"","",null,null,""]
[null,null,null,null,"","",null,null,""]
["Classe 3","Classe","prof3",null,"","",null,null,"",{"$f":"IF(COUNTA(D17:D22)<=2,\"\",COUNTA(D17:D22))","v":""}]
[null,"3è3",null,null,"","",null,null,""]
[null,null,null,null,"","",null,null,""]
[null,"nbre d'élèves :   ",null,null,"","",null,null,""]
[null,null,null,null,"","",null,null,""]
[null,null,null,null,"","",null,null,""]
["Classe 4","Classe","prof4",null,"","",null,null,"",{"$f":"IF(COUNTA(D23:D28)<=2,\"\",COUNTA(D23:D28))","v":""}]
[null,"3è4",null,null,"","",null,null,""]
[null,null,null,null,"","",null,null,""]
[null,"nbre d'élèves :   ",null,null,"","",null,null,""]
[null,null,null,null,"","",null,null,""]
[null,null,null,null,"","",null,null,""]
["Classe 5","Classe","prof5",null,"","",null,null,"",{"$f":"IF(COUNTA(D29:D34)<=2,\"\",COUNTA(D29:D34))","v":""}]
[null,"3è5",null,null,"","",null,null,""]
[null,null,null,null,"","",null,null,""]
[null,"nbre d'élèves :   ",null,null,"","",null,null,""]
[null,null,null,null,"","",null,null,""]
[null,null,null,null,"","",null,null,""]
["Classe 6","Classe","prof6",null,"","",null,null,"",{"$f":"IF(COUNTA(D35:D40)<=2,\"\",COUNTA(D35:D40))","v":""}]
[null,"3è6",null,null,"","",null,null,""]
[null,null,null,null,"","",null,null,""]
[null,"nbre d'élèves :   ",null,null,"","",null,null,""]
[null,null,null,null,"","",null,null,""]
[null,null,null,null,"","",null,null,""]
["Classe 7","Classe","prof7",null,"","",null,null,{"$f":"IF(ISERROR(E41),1,\"\")","v":""},{"$f":"IF(COUNTA(D41:D46)<=2,\"\",COUNTA(D41:D46))","v":""}]
[null,"3è7",null,null,"","",null,null,{"$f":"IF(ISERROR(E42),1,\"\")","v":""}]
[null,null,null,null,"","",null,null,""]
[null,"nbre d'élèves :   ",null,null,"","",null,null,""]
[null,null,null,null,"","",null,null,""]
[null,null,null,null,"","",null,null,""]
["Classe 8","Classe","prof8",null,"","",null,null,"",{"$f":"IF(COUNTA(D47:D52)<=2,\"\",COUNTA(D47:D52))","v":""}]
[null,"3è8",null,null,"","",null,null,""]
[null,null,null,null,"","",null,null,""]
[null,"nbre d'élèves :   ",null,null,"","",null,null,""]
[null,null,null,null,"","",null,null,""]
[null,null,null,null,"","",null,null,""]
["Classe 9","Classe","prof9",null,"","",null,null,"",{"$f":"IF(COUNTA(D53:D58)<=2,\"\",COUNTA(D53:D58))","v":""}]
[null,"3è9",null,null,"","",null,null,""]
[null,null,null,null,"","",null,null,""]
[null,"nbre d'élèves :   ",null,null,"","",null,null,""]
[null,null,null,null,"","",null,null,""]
[null,null,null,null,"","",null,null,""]
["Classe 10","Classe","prof10",null,"","",null,null,"",{"$f":"IF(COUNTA(D59:D64)<=2,\"\",COUNTA(D59:D64))","v":""}]
[null,"3è10",null,null,"","",null,null,""]
[null,null,null,null,"","",null,null,""]
[null,"nbre d'élèves :   ",null,null,"","",null,null,""]
[null,null,null,null,"","",null,null,""]
[null,null,null,null,"","",null,null,""]
["Classe 11","Classe","prof11",null,"","",null,null,"",{"$f":"IF(COUNTA(D65:D70)<=2,\"\",COUNTA(D65:D70))","v":""}]
[null,"3è11",null,null,"","",null,null,""]
[null,null,null,null,"","",null,null,""]
[null,"nbre d'élèves :   ",null,null,"","",null,null,""]
[null,null,null,null,"","",null,null,""]
[null,null,null,null,"","",null,null,""]
["Classe 12","Classe","prof12",null,"","",null,null,"",{"$f":"IF(COUNTA(D71:D76)<=2,\"\",COUNTA(D71:D76))","v":""}]
[null,"3è12",null,null,"","",null,null,""]
[null,null,null,null,"","",null,null,""]
[null,"nbre d'élèves :   ",null,null,"","",null,null,""]
[null,null,null,null,"","",null,null,""]
[null,null,null,null,"","",null,null,""]
[null,null,null,null,null,null,null,null,{"$f":"IF(COUNT(I5:I76)=0,\"\",\"Attention, une ou plusieurs APSA du protocole sont mal saisies!\")","v":""},{"$f":"AVERAGE(J5:J71)","v":3}]
[null,"Date de validation par le chef d'établissement :",null,null,null,null,null,null,null,{"$f":"COUNT(J5:J71)","v":2}]
[null,"Informations à transmettre à l'inspection :"]
[]
[null,null,null,null,null,null,null,null,""]
[]
[null,"Partie reservée à l'inspection :"]

{"sheet":"9830384A","index":27,"n_rows":83,"n_cols":10,"rows_kept":83,"cut":false,"hidden":false,"merged":[[0,3,0,5],[2,1,3,1],[2,2,3,2],[2,3,3,3],[2,4,2,5],[2,7,3,7],[4,0,9,0],[4,2,9,2],[10,0,15,0],[10,2,15,2],[16,0,21,0],[16,2,21,2],[2,6,3,6],[58,0,63,0],[58,2,63,2],[22,0,27,0],[22,2,27,2],[28,0,33,0],[28,2,33,2],[34,0,39,0],[34,2,39,2],[64,0,69,0],[64,2,69,2],[70,0,75,0],[70,2,75,2],[40,0,45,0],[40,2,45,2],[46,0,51,0],[46,2,51,2],[52,0,57,0],[52,2,57,2]]}
["R","DNB 2014","9830384A","CLG DE BOULARI ET SEGPA",null,null,"PROVINCE SUD","Académie de Nouvelle-Calédonie",{"$f":"IF(C1=\"\",\"\",VLOOKUP(C1,etab,4,FALSE))","v":"public"}]
["GEBEPS_2014_IPR_PROTOCOLES_public_9830384A.xls",null,null,null,"",null,null,null,{"$f":"Données!M11","v":"V3_29/10/13"}]
[null,"CLASSES            évaluées pour le DNB","NOM \nde l'enseignant responsable de la classe","Activités","Compétences\npropres",null,"dates des évaluations","dates des rattrapages",null,"nbre APSA\n/ classe"]
[null,null,null,null,"CP","Liste"]
["Classe 1","Classe","Mr MILLET","Badminton","CP4","N","2014-04-29","2014-11-04",{"$f":"IF(ISERROR(E5),1,\"\")","v":""},{"$f":"IF(COUNTA(D5:D10)<=2,\"\",COUNTA(D5:D10))","v":3}]
[null,302,null,"Relais-vitesse","CP1","N","2014-07-22","2014-11-04",{"$f":"IF(ISERROR(E6),1,\"\")","v":""}]
[null,null,null,"Acrosport","CP3","N","2014-10-28","2014-11-04",""]
[null,"nbre d'élèves :   ",null,null,"","",null,null,""]
[null,20,null,null,"","",null,null,""]
[null,null,null,null,"","",null,null,""]
["Classe 2","Classe","Mr MILLET","Badminton","CP4","N","2014-04-25","2014-11-04","",{"$f":"IF(COUNTA(D11:D16)<=2,\"\",COUNTA(D11:D16))","v":3}]
[null,303,null,"Relais-vitesse","CP1","N","2014-07-25","2014-11-04",""]
[null,null,null,"Acrosport","CP3","N","2014-10-31","2014-11-04",""]
[null,"nbre d'élèves :   ",null,null,"","",null,null,""]
[null,23,null,null,"","",null,null,""]
[null,null,null,null,"","",null,null,""]
["Classe 3","Classe","Mr MILLET","Acrosport","CP3","N","2014-04-30","2014-11-04","",{"$f":"IF(COUNTA(D17:D22)<=2,\"\",COUNTA(D17:D22))","v":3}]
[null,304,null,"Relais-vitesse","CP1","N","2014-07-23","2014-11-04",""]
[null,null,null,"Badminton","CP4","N","2014-10-29","2014-11-04",""]
[null,"nbre d'élèves :   ",null,null,"","",null,null,""]
[null,22,null,null,"","",null,null,""]
[null,null,null,null,"","",null,null,""]
["Classe 4","Classe","Mr MARTINI","Acrosport","CP3","N","2014-04-30","2014-11-04","",{"$f":"IF(COUNTA(D23:D28)<=2,\"\",COUNTA(D23:D28))","v":3}]
[null,305,null,"Relais-vitesse","CP1","N","2014-07-23","2014-11-04",""]
[null,null,null,"Badminton","CP4","N","2014-10-29","2014-11-04",""]
[null,"nbre d'élèves :   ",null,null,"","",null,null,""]
[null,null,null,null,"","",null,null,""]
[null,null,null,null,"","",null,null,""]
["Classe 5","Classe","Mme C.Duhaze","Acrosport","CP3","N","2014-04-24","2014-11-04","",{"$f":"IF(COUNTA(D29:D34)<=2,\"\",COUNTA(D29:D34))","v":3}]
[null,306,null,"Badminton","CP4","N","2014-07-24","2014-11-04",""]
[null,null,null,"Relais-vitesse","CP1","N","2014-10-30","2014-11-04",""]
[null,"nbre d'élèves :   ",null,null,"","",null,null,""]
[null,null,null,null,"","",null,null,""]
[null,null,null,null,"","",null,null,""]
["Classe 6","Classe","Mr M.Duhaze","Acrosport","CP3","N","2014-04-25","2014-11-04","",{"$f":"IF(COUNTA(D35:D40)<=2,\"\",COUNTA(D35:D40))","v":3}]
[null,307,null,"Badminton","CP4","N","2014-07-25","2104-11-04",""]
[null,null,null,"Relais-vitesse","CP1","N","2014-10-31","2014-11-04",""]
[null,"nbre d'élèves :   ",null,null,"","",null,null,""]
[null,22,null,null,"","",null,null,""]
[null,null,null,null,"","",null,null,""]
["Classe 7","Classe","Mr M.Duhaze","Acrosport","CP3","N","2014-04-28","2014-11-04",{"$f":"IF(ISERROR(E41),1,\"\")","v":""},{"$f":"IF(COUNTA(D41:D46)<=2,\"\",COUNTA(D41:D46))","v":3}]
[null,308,null,"Relais-vitesse","CP1","N","2014-07-21","2014-11-04",{"$f":"IF(ISERROR(E42),1,\"\")","v":""}]
[null,null,null,"Badminton","CP4","N","2014-10-27","2014-11-04",""]
[null,"nbre d'élèves :   ",null,null,"","",null,null,""]
[null,null,null,null,"","",null,null,""]
[null,23,null,null,"","",null,null,""]
["Classe 8","Classe",null,null,"","",null,null,"",{"$f":"IF(COUNTA(D47:D52)<=2,\"\",COUNTA(D47:D52))","v":""}]
[null,null,null,null,"","",null,null,""]
[null,null,null,null,"","",null,null,""]
[null,"nbre d'élèves :   ",null,null,"","",null,null,""]
[null,null,null,null,"","",null,null,""]
[null,null,null,null,"","",null,null,""]
["Classe 9","Classe","prof9",null,"","",null,null,"",{"$f":"IF(COUNTA(D53:D58)<=2,\"\",COUNTA(D53:D58))","v":""}]
[null,null,null,null,"","",null,null,""]
[null,null,null,null,"","",null,null,""]
[null,"nbre d'élèves :   ",null,null,"","",null,null,""]
[null,null,null,null,"","",null,null,""]
[null,null,null,null,"","",null,null,""]
["Classe 10","Classe","prof10",null,"","",null,null,"",{"$f":"IF(COUNTA(D59:D64)<=2,\"\",COUNTA(D59:D64))","v":""}]
[null,null,null,null,"","",null,null,""]
[null,null,null,null,"","",null,null,""]
[null,"nbre d'élèves :   ",null,null,"","",null,null,""]
[null,null,null,null,"","",null,null,""]
[null,null,null,null,"","",null,null,""]
["Classe 11","Classe","prof11",null,"","",null,null,"",{"$f":"IF(COUNTA(D65:D70)<=2,\"\",COUNTA(D65:D70))","v":""}]
[null,"3è11",null,null,"","",null,null,""]
[null,null,null,null,"","",null,null,""]
[null,"nbre d'élèves :   ",null,null,"","",null,null,""]
[null,null,null,null,"","",null,null,""]
[null,null,null,null,"","",null,null,""]
["Classe 12","Classe","prof12",null,"","",null,null,"",{"$f":"IF(COUNTA(D71:D76)<=2,\"\",COUNTA(D71:D76))","v":""}]
[null,"3è12",null,null,"","",null,null,""]
[null,null,null,null,"","",null,null,""]
[null,"nbre d'élèves :   ",null,null,"","",null,null,""]
[null,null,null,null,"","",null,null,""]
[null,null,null,null,"","",null,null,""]
[null,null,null,null,null,null,null,null,{"$f":"IF(COUNT(I5:I76)=0,\"\",\"Attention, une ou plusieurs APSA du protocole sont mal saisies!\")","v":""},{"$f":"AVERAGE(J5:J71)","v":3}]
[null,"Date de validation par le chef d'établissement :",null,null,null,null,null,null,null,{"$f":"COUNT(J5:J71)","v":7}]
[null,"Informations à transmettre à l'inspection :"]
[]
[null,null,null,null,null,null,null,null,""]
[]
[null,"Partie reservée à l'inspection :"]

{"sheet":"9830357W","index":28,"n_rows":83,"n_cols":10,"rows_kept":83,"cut":false,"hidden":false,"merged":[[64,0,69,0],[64,2,69,2],[70,0,75,0],[70,2,75,2],[28,2,33,2],[52,0,57,0],[52,2,57,2],[58,0,63,0],[58,2,63,2],[40,0,45,0],[40,2,45,2],[46,0,51,0],[46,2,51,2],[2,7,3,7],[4,0,9,0],[4,2,9,2],[10,0,15,0],[10,2,15,2],[16,0,21,0],[16,2,21,2],[2,6,3,6],[0,3,0,5],[2,1,3,1],[2,2,3,2],[2,3,3,3],[2,4,2,5],[34,0,39,0],[34,2,39,2],[22,0,27,0],[22,2,27,2],[28,0,33,0]]}
["R","DNB 2014","9830357W","CLG LAURA BOULA ET SEGPA - WE LIFOU",null,null,"PROVINCE DES ILES","Académie de Nouvelle-Calédonie",{"$f":"IF(C1=\"\",\"\",VLOOKUP(C1,etab,4,FALSE))","v":"public"}]
["GEBEPS_2014_IPR_PROTOCOLES_public_9830357W.xls",null,null,null,"",null,null,null,{"$f":"Données!M11","v":"V3_29/10/13"}]
[null,"CLASSES            évaluées pour le DNB","NOM \nde l'enseignant responsable de la classe","Activités","Compétences\npropres",null,"dates des évaluations","dates des rattrapages",null,"nbre APSA\n/ classe"]
[null,null,null,null,"CP","Liste"]
["Classe 1","Classe","FRANCOISE","Planche à voile","CP2","A","2014-04-18","2014-04-25",{"$f":"IF(ISERROR(E5),1,\"\")","v":""},{"$f":"IF(COUNTA(D5:D10)<=2,\"\",COUNTA(D5:D10))","v":3}]
[null,"3è1",null,"Relais-vitesse","CP1","N","2014-07-25","2014-08-01",{"$f":"IF(ISERROR(E6),1,\"\")","v":""}]
[null,null,null,"Hand","CP4","N","2014-10-31","2014-11-07",""]
[null,"nbre d'élèves :   ",null,null,"","",null,null,""]
[null,18,null,null,"","",null,null,""]
[null,null,null,null,"","",null,null,""]
["Classe 2","Classe","BONNET","Relais-vitesse","CP1","N","2014-04-28","2014-05-05","",{"$f":"IF(COUNTA(D11:D16)<=2,\"\",COUNTA(D11:D16))","v":3}]
[null,"3è2",null,"Planche à voile","CP2","A","2014-07-21","2014-07-28",""]
[null,null,null,"Hand","CP4","N","2014-10-27","2014-11-03",""]
[null,"nbre d'élèves :   ",null,null,"","",null,null,""]
[null,19,null,null,"","",null,null,""]
[null,null,null,null,"","",null,null,""]
["Classe 3","Classe","LAROCHE","Planche à voile","CP2","A","2014-04-29","2014-05-06","",{"$f":"IF(COUNTA(D17:D22)<=2,\"\",COUNTA(D17:D22))","v":3}]
[null,"3è3",null,"Relais-vitesse","CP1","N","2014-07-22","2014-07-29",""]
[null,null,null,"Hand","CP4","N","2014-10-28","2014-11-04",""]
[null,"nbre d'élèves :   ",null,null,"","",null,null,""]
[null,20,null,null,"","",null,null,""]
[null,null,null,null,"","",null,null,""]
["Classe 4","Classe","prof4",null,"","",null,null,"",{"$f":"IF(COUNTA(D23:D28)<=2,\"\",COUNTA(D23:D28))","v":""}]
[null,"3è4",null,null,"","",null,null,""]
[null,null,null,null,"","",null,null,""]
[null,"nbre d'élèves :   ",null,null,"","",null,null,""]
[null,null,null,null,"","",null,null,""]
[null,null,null,null,"","",null,null,""]
["Classe 5","Classe","prof5",null,"","",null,null,"",{"$f":"IF(COUNTA(D29:D34)<=2,\"\",COUNTA(D29:D34))","v":""}]
[null,"3è5",null,null,"","",null,null,""]
[null,null,null,null,"","",null,null,""]
[null,"nbre d'élèves :   ",null,null,"","",null,null,""]
[null,null,null,null,"","",null,null,""]
[null,null,null,null,"","",null,null,""]
["Classe 6","Classe","prof6",null,"","",null,null,"",{"$f":"IF(COUNTA(D35:D40)<=2,\"\",COUNTA(D35:D40))","v":""}]
[null,"3è6",null,null,"","",null,null,""]
[null,null,null,null,"","",null,null,""]
[null,"nbre d'élèves :   ",null,null,"","",null,null,""]
[null,null,null,null,"","",null,null,""]
[null,null,null,null,"","",null,null,""]
["Classe 7","Classe","prof7",null,"","",null,null,{"$f":"IF(ISERROR(E41),1,\"\")","v":""},{"$f":"IF(COUNTA(D41:D46)<=2,\"\",COUNTA(D41:D46))","v":""}]
[null,"3è7",null,null,"","",null,null,{"$f":"IF(ISERROR(E42),1,\"\")","v":""}]
[null,null,null,null,"","",null,null,""]
[null,"nbre d'élèves :   ",null,null,"","",null,null,""]
[null,null,null,null,"","",null,null,""]
[null,null,null,null,"","",null,null,""]
["Classe 8","Classe","prof8",null,"","",null,null,"",{"$f":"IF(COUNTA(D47:D52)<=2,\"\",COUNTA(D47:D52))","v":""}]
[null,"3è8",null,null,"","",null,null,""]
[null,null,null,null,"","",null,null,""]
[null,"nbre d'élèves :   ",null,null,"","",null,null,""]
[null,null,null,null,"","",null,null,""]
[null,null,null,null,"","",null,null,""]
["Classe 9","Classe","prof9",null,"","",null,null,"",{"$f":"IF(COUNTA(D53:D58)<=2,\"\",COUNTA(D53:D58))","v":""}]
[null,"3è9",null,null,"","",null,null,""]
[null,null,null,null,"","",null,null,""]
[null,"nbre d'élèves :   ",null,null,"","",null,null,""]
[null,null,null,null,"","",null,null,""]
[null,null,null,null,"","",null,null,""]
["Classe 10","Classe","prof10",null,"","",null,null,"",{"$f":"IF(COUNTA(D59:D64)<=2,\"\",COUNTA(D59:D64))","v":""}]
[null,"3è10",null,null,"","",null,null,""]
[null,null,null,null,"","",null,null,""]
[null,"nbre d'élèves :   ",null,null,"","",null,null,""]
[null,null,null,null,"","",null,null,""]
[null,null,null,null,"","",null,null,""]
["Classe 11","Classe","prof11",null,"","",null,null,"",{"$f":"IF(COUNTA(D65:D70)<=2,\"\",COUNTA(D65:D70))","v":""}]
[null,"3è11",null,null,"","",null,null,""]
[null,null,null,null,"","",null,null,""]
[null,"nbre d'élèves :   ",null,null,"","",null,null,""]
[null,null,null,null,"","",null,null,""]
[null,null,null,null,"","",null,null,""]
["Classe 12","Classe","prof12",null,"","",null,null,"",{"$f":"IF(COUNTA(D71:D76)<=2,\"\",COUNTA(D71:D76))","v":""}]
[null,"3è12",null,null,"","",null,null,""]
[null,null,null,null,"","",null,null,""]
[null,"nbre d'élèves :   ",null,null,"","",null,null,""]
[null,null,null,null,"","",null,null,""]
[null,null,null,null,"","",null,null,""]
[null,null,null,null,null,null,null,null,{"$f":"IF(COUNT(I5:I76)=0,\"\",\"Attention, une ou plusieurs APSA du protocole sont mal saisies!\")","v":""},{"$f":"AVERAGE(J5:J71)","v":3}]
[null,"Date de validation par le chef d'établissement :",null,null,null,null,null,null,null,{"$f":"COUNT(J5:J71)","v":3}]
[null,"Informations à transmettre à l'inspection :"]
[]
[null,null,null,null,null,null,null,null,""]
[]
[null,"Partie reservée à l'inspection :"]

{"sheet":"9830356V","index":29,"n_rows":83,"n_cols":10,"rows_kept":83,"cut":false,"hidden":false,"merged":[[0,3,0,5],[2,1,3,1],[2,2,3,2],[2,3,3,3],[2,4,2,5],[2,7,3,7],[4,0,9,0],[4,2,9,2],[10,0,15,0],[10,2,15,2],[16,0,21,0],[16,2,21,2],[2,6,3,6],[58,0,63,0],[58,2,63,2],[22,0,27,0],[22,2,27,2],[28,0,33,0],[28,2,33,2],[34,0,39,0],[34,2,39,2],[64,0,69,0],[64,2,69,2],[70,0,75,0],[70,2,75,2],[40,0,45,0],[40,2,45,2],[46,0,51,0],[46,2,51,2],[52,0,57,0],[52,2,57,2]]}
["R","DNB 2014","9830356V","CLG DE MAGENTA ET SEGPA - NOUMEA",null,null,"PROVINCE SUD","Académie de Nouvelle-Calédonie",{"$f":"IF(C1=\"\",\"\",VLOOKUP(C1,etab,4,FALSE))","v":"public"}]
["GEBEPS_2014_IPR_PROTOCOLES_public_9830356V.xls",null,null,null,"",null,null,null,{"$f":"Données!M11","v":"V3_29/10/13"}]
[null,"CLASSES            évaluées pour le DNB","NOM \nde l'enseignant responsable de la classe","Activités","Compétences\npropres",null,"dates des évaluations","dates des rattrapages",null,"nbre APSA\n/ classe"]
[null,null,null,null,"CP","Liste"]
["Classe 1","Classe","BEDOS","CO","CP2","N","2014-05-05","2014-11-07",{"$f":"IF(ISERROR(E5),1,\"\")","v":""},{"$f":"IF(COUNTA(D5:D10)<=2,\"\",COUNTA(D5:D10))","v":""}]
[null,301,null,"Badminton","CP4","N","2014-04-25","2014-11-07",{"$f":"IF(ISERROR(E6),1,\"\")","v":""}]
[null,null,null,null,"","",null,null,""]
[null,"nbre d'élèves :   ",null,null,"","",null,null,""]
[null,16,null,null,"","",null,null,""]
[null,null,null,null,"","",null,null,""]
["Classe 2","Classe","DUPONT","Relais-vitesse","CP1","N","2014-04-24","2014-11-07","",{"$f":"IF(COUNTA(D11:D16)<=2,\"\",COUNTA(D11:D16))","v":3}]
[null,302,null,"CO","CP2","N","2014-11-06","2014-11-07",""]
[null,16,null,"Badminton","CP4","N","2014-11-03","2014-11-07",""]
[null,"nbre d'élèves :   ",null,null,"","",null,null,""]
[null,24,null,null,"","",null,null,""]
[null,null,null,null,"","",null,null,""]
["Classe 3","Classe","BILLON","Relais-vitesse","CP1","N","2014-08-01","2014-11-07","",{"$f":"IF(COUNTA(D17:D22)<=2,\"\",COUNTA(D17:D22))","v":3}]
[null,303,null,"CO","CP2","N","2014-11-07","2014-11-07",""]
[null,null,null,"Badminton","CP4","N","2014-05-06","2014-11-07",""]
[null,"nbre d'élèves :   ",null,null,"","",null,null,""]
[null,27,null,null,"","",null,null,""]
[null,null,null,null,"","",null,null,""]
["Classe 4","Classe","PICHERIT","Relais-vitesse","CP1","N","2014-10-31","2014-11-07","",{"$f":"IF(COUNTA(D23:D28)<=2,\"\",COUNTA(D23:D28))","v":3}]
[null,304,null,"CO","CP2","N","2014-04-25","2014-11-07",""]
[null,null,null,"Badminton","CP4","N","2014-07-07","2014-11-07",""]
[null,"nbre d'élèves :   ",null,null,"","",null,null,""]
[null,30,null,null,"","",null,null,""]
[null,null,null,null,"","",null,null,""]
["Classe 5","Classe","DUPONT","Relais-vitesse","CP1","N","2014-07-25","2014-11-07","",{"$f":"IF(COUNTA(D29:D34)<=2,\"\",COUNTA(D29:D34))","v":3}]
[null,305,null,"CO","CP2","N","2014-10-31","2014-11-07",""]
[null,null,null,"Badminton","CP4","N","2014-04-28","2014-11-07",""]
[null,"nbre d'élèves :   ",null,null,"","",null,null,""]
[null,28,null,null,"","",null,null,""]
[null,null,null,null,"","",null,null,""]
["Classe 6","Classe","BILLON","Relais-vitesse","CP1","N","2014-07-29","2014-11-07","",{"$f":"IF(COUNTA(D35:D40)<=2,\"\",COUNTA(D35:D40))","v":3}]
[null,306,null,"CO","CP2","N","2014-11-04","2014-11-07",""]
[null,null,null,"Badminton","CP4","N","2014-11-02","2014-11-07",""]
[null,"nbre d'élèves :   ",null,null,"","",null,null,""]
[null,30,null,null,"","",null,null,""]
[null,null,null,null,"","",null,null,""]
["Classe 7","Classe","ROUX","Relais-vitesse","CP1","N","2014-05-05","2014-11-07",{"$f":"IF(ISERROR(E41),1,\"\")","v":""},{"$f":"IF(COUNTA(D41:D46)<=2,\"\",COUNTA(D41:D46))","v":3}]
[null,307,null,"CO","CP2","N","2014-11-06","2014-11-07",{"$f":"IF(ISERROR(E42),1,\"\")","v":""}]
[null,null,null,"Badminton","CP4","N","2014-04-24","2014-11-07",""]
[null,"nbre d'élèves :   ",null,null,"","",null,null,""]
[null,null,null,null,"","",null,null,""]
[null,null,null,null,"","",null,null,""]
["Classe 8","Classe","QUERE","Badminton","CP4","N","2014-04-30","2014-11-07","",{"$f":"IF(COUNTA(D47:D52)<=2,\"\",COUNTA(D47:D52))","v":3}]
[null,308,null,"Relais-vitesse","CP1","N","2014-10-06","2014-11-07",""]
[null,null,null,"CO","CP2","N","2014-10-29","2014-11-07",""]
[null,"nbre d'élèves :   ",null,null,"","",null,null,""]
[null,30,null,null,"","",null,null,""]
[null,null,null,null,"","",null,null,""]
["Classe 9","Classe","DEBARNOT","Relais-vitesse","CP1","N","2014-07-21","2014-11-07","",{"$f":"IF(COUNTA(D53:D58)<=2,\"\",COUNTA(D53:D58))","v":3}]
[null,309,null,"CO","CP2","N","2014-10-27","2014-11-07",""]
[null,null,null,"Badminton","CP4","N","2014-04-04","2014-11-07",""]
[null,"nbre d'élèves :   ",null,null,"","",null,null,""]
[null,30,null,null,"","",null,null,""]
[null,null,null,null,"","",null,null,""]
["Classe 10","Classe","DEBARNOT","Relais-vitesse","CP1","N","2014-07-23","2014-11-07","",{"$f":"IF(COUNTA(D59:D64)<=2,\"\",COUNTA(D59:D64))","v":3}]
[null,310,null,"CO","CP2","N","2014-10-27","2014-11-07",""]
[null,null,null,"Badminton","CP4","N","2014-10-29","2014-11-07",""]
[null,"nbre d'élèves :   ",null,null,"","",null,null,""]
[null,30,null,null,"","",null,null,""]
[null,null,null,null,"","",null,null,""]
["Classe 11","Classe","prof11",null,"","",null,null,"",{"$f":"IF(COUNTA(D65:D70)<=2,\"\",COUNTA(D65:D70))","v":""}]
[null,"3è11",null,null,"","",null,null,""]
[null,null,null,null,"","",null,null,""]
[null,"nbre d'élèves :   ",null,null,"","",null,null,""]
[null,null,null,null,"","",null,null,""]
[null,null,null,null,"","",null,null,""]
["Classe 12","Classe","prof12",null,"","",null,null,"",{"$f":"IF(COUNTA(D71:D76)<=2,\"\",COUNTA(D71:D76))","v":""}]
[null,"3è12",null,null,"","",null,null,""]
[null,null,null,null,"","",null,null,""]
[null,"nbre d'élèves :   ",null,null,"","",null,null,""]
[null,null,null,null,"","",null,null,""]
[null,null,null,null,"","",null,null,""]
[null,null,null,null,null,null,null,null,{"$f":"IF(COUNT(I5:I76)=0,\"\",\"Attention, une ou plusieurs APSA du protocole sont mal saisies!\")","v":""},{"$f":"AVERAGE(J5:J71)","v":3}]
[null,"Date de validation par le chef d'établissement :",null,null,null,null,null,null,null,{"$f":"COUNT(J5:J71)","v":9}]
[null,"Informations à transmettre à l'inspection :"]
[]
[null,null,null,null,null,null,null,null,""]
[]
[null,"Partie reservée à l'inspection :"]

{"sheet":"9830355U","index":30,"n_rows":83,"n_cols":10,"rows_kept":83,"cut":false,"hidden":false,"merged":[[64,0,69,0],[64,2,69,2],[70,0,75,0],[70,2,75,2],[28,2,33,2],[52,0,57,0],[52,2,57,2],[58,0,63,0],[58,2,63,2],[40,0,45,0],[40,2,45,2],[46,0,51,0],[46,2,51,2],[2,7,3,7],[4,0,9,0],[4,2,9,2],[10,0,15,0],[10,2,15,2],[16,0,21,0],[16,2,21,2],[2,6,3,6],[0,3,0,5],[2,1,3,1],[2,2,3,2],[2,3,3,3],[2,4,2,5],[34,0,39,0],[34,2,39,2],[22,0,27,0],[22,2,27,2],[28,0,33,0]]}
["R","DNB 2014","9830355U","CLG DE THIO",null,null,"PROVINCE SUD","Académie de Nouvelle-Calédonie",{"$f":"IF(C1=\"\",\"\",VLOOKUP(C1,etab,4,FALSE))","v":"public"}]
["GEBEPS_2014_IPR_PROTOCOLES_public_9830355U.xls",null,null,null,"",null,null,null,{"$f":"Données!M11","v":"V3_29/10/13"}]
[null,"CLASSES            évaluées pour le DNB","NOM \nde l'enseignant responsable de la classe","Activités","Compétences\npropres",null,"dates des évaluations","dates des rattrapages",null,"nbre APSA\n/ classe"]
[null,null,null,null,"CP","Liste"]
["Classe 1","Classe","CHESNAIS","Hand","CP4","N","2014-05-06","2014-11-04",{"$f":"IF(ISERROR(E5),1,\"\")","v":""},{"$f":"IF(COUNTA(D5:D10)<=2,\"\",COUNTA(D5:D10))","v":3}]
[null,"3è1",null,"Demi-fond","CP1","N","2014-07-29","2014-11-04",{"$f":"IF(ISERROR(E6),1,\"\")","v":""}]
[null,null,null,"CO","CP2","N","2014-11-04","2014-11-04",""]
[null,"nbre d'élèves :   ",null,null,"","",null,null,""]
[null,21,null,null,"","",null,null,""]
[null,null,null,null,"","",null,null,""]
["Classe 2","Classe","CHESNAIS","Ultimate","CP4","A","2014-05-06","2014-11-04","",{"$f":"IF(COUNTA(D11:D16)<=2,\"\",COUNTA(D11:D16))","v":3}]
[null,"3è2",null,"Demi-fond","CP1","N","2014-07-29","2014-11-04",""]
[null,null,null,"CO","CP2","N","2014-11-04","2014-11-04",""]
[null,"nbre d'élèves :   ",null,null,"","",null,null,""]
[null,12,null,null,"","",null,null,""]
[null,null,null,null,"","",null,null,""]
["Classe 3","Classe","prof3",null,"","",null,null,"",{"$f":"IF(COUNTA(D17:D22)<=2,\"\",COUNTA(D17:D22))","v":""}]
[null,"3è3",null,null,"","",null,null,""]
[null,null,null,null,"","",null,null,""]
[null,"nbre d'élèves :   ",null,null,"","",null,null,""]
[null,null,null,null,"","",null,null,""]
[null,null,null,null,"","",null,null,""]
["Classe 4","Classe","prof4",null,"","",null,null,"",{"$f":"IF(COUNTA(D23:D28)<=2,\"\",COUNTA(D23:D28))","v":""}]
[null,"3è4",null,null,"","",null,null,""]
[null,null,null,null,"","",null,null,""]
[null,"nbre d'élèves :   ",null,null,"","",null,null,""]
[null,null,null,null,"","",null,null,""]
[null,null,null,null,"","",null,null,""]
["Classe 5","Classe","prof5",null,"","",null,null,"",{"$f":"IF(COUNTA(D29:D34)<=2,\"\",COUNTA(D29:D34))","v":""}]
[null,"3è5",null,null,"","",null,null,""]
[null,null,null,null,"","",null,null,""]
[null,"nbre d'élèves :   ",null,null,"","",null,null,""]
[null,null,null,null,"","",null,null,""]
[null,null,null,null,"","",null,null,""]
["Classe 6","Classe","prof6",null,"","",null,null,"",{"$f":"IF(COUNTA(D35:D40)<=2,\"\",COUNTA(D35:D40))","v":""}]
[null,"3è6",null,null,"","",null,null,""]
[null,null,null,null,"","",null,null,""]
[null,"nbre d'élèves :   ",null,null,"","",null,null,""]
[null,null,null,null,"","",null,null,""]
[null,null,null,null,"","",null,null,""]
["Classe 7","Classe","prof7",null,"","",null,null,{"$f":"IF(ISERROR(E41),1,\"\")","v":""},{"$f":"IF(COUNTA(D41:D46)<=2,\"\",COUNTA(D41:D46))","v":""}]
[null,"3è7",null,null,"","",null,null,{"$f":"IF(ISERROR(E42),1,\"\")","v":""}]
[null,null,null,null,"","",null,null,""]
[null,"nbre d'élèves :   ",null,null,"","",null,null,""]
[null,null,null,null,"","",null,null,""]
[null,null,null,null,"","",null,null,""]
["Classe 8","Classe","prof8",null,"","",null,null,"",{"$f":"IF(COUNTA(D47:D52)<=2,\"\",COUNTA(D47:D52))","v":""}]
[null,"3è8",null,null,"","",null,null,""]
[null,null,null,null,"","",null,null,""]
[null,"nbre d'élèves :   ",null,null,"","",null,null,""]
[null,null,null,null,"","",null,null,""]
[null,null,null,null,"","",null,null,""]
["Classe 9","Classe","prof9",null,"","",null,null,"",{"$f":"IF(COUNTA(D53:D58)<=2,\"\",COUNTA(D53:D58))","v":""}]
[null,"3è9",null,null,"","",null,null,""]
[null,null,null,null,"","",null,null,""]
[null,"nbre d'élèves :   ",null,null,"","",null,null,""]
[null,null,null,null,"","",null,null,""]
[null,null,null,null,"","",null,null,""]
["Classe 10","Classe","prof10",null,"","",null,null,"",{"$f":"IF(COUNTA(D59:D64)<=2,\"\",COUNTA(D59:D64))","v":""}]
[null,"3è10",null,null,"","",null,null,""]
[null,null,null,null,"","",null,null,""]
[null,"nbre d'élèves :   ",null,null,"","",null,null,""]
[null,null,null,null,"","",null,null,""]
[null,null,null,null,"","",null,null,""]
["Classe 11","Classe","prof11",null,"","",null,null,"",{"$f":"IF(COUNTA(D65:D70)<=2,\"\",COUNTA(D65:D70))","v":""}]
[null,"3è11",null,null,"","",null,null,""]
[null,null,null,null,"","",null,null,""]
[null,"nbre d'élèves :   ",null,null,"","",null,null,""]
[null,null,null,null,"","",null,null,""]
[null,null,null,null,"","",null,null,""]
["Classe 12","Classe","prof12",null,"","",null,null,"",{"$f":"IF(COUNTA(D71:D76)<=2,\"\",COUNTA(D71:D76))","v":""}]
[null,"3è12",null,null,"","",null,null,""]
[null,null,null,null,"","",null,null,""]
[null,"nbre d'élèves :   ",null,null,"","",null,null,""]
[null,null,null,null,"","",null,null,""]
[null,null,null,null,"","",null,null,""]
[null,null,null,null,null,null,null,null,{"$f":"IF(COUNT(I5:I76)=0,\"\",\"Attention, une ou plusieurs APSA du protocole sont mal saisies!\")","v":""},{"$f":"AVERAGE(J5:J71)","v":3}]
[null,"Date de validation par le chef d'établissement :",null,null,null,null,null,null,null,{"$f":"COUNT(J5:J71)","v":2}]
[null,"Informations à transmettre à l'inspection :"]
[]
[null,null,null,null,null,null,null,null,""]
[]
[null,"Partie reservée à l'inspection :"]

{"sheet":"9830304N","index":31,"n_rows":83,"n_cols":10,"rows_kept":83,"cut":false,"hidden":false,"merged":[[0,3,0,5],[2,1,3,1],[2,2,3,2],[2,3,3,3],[2,4,2,5],[2,7,3,7],[4,0,9,0],[4,2,9,2],[10,0,15,0],[10,2,15,2],[16,0,21,0],[16,2,21,2],[2,6,3,6],[58,0,63,0],[58,2,63,2],[22,0,27,0],[22,2,27,2],[28,0,33,0],[28,2,33,2],[34,0,39,0],[34,2,39,2],[64,0,69,0],[64,2,69,2],[70,0,75,0],[70,2,75,2],[40,0,45,0],[40,2,45,2],[46,0,51,0],[46,2,51,2],[52,0,57,0],[52,2,57,2]]}
["R","DNB 2014","9830304N","CLG DE RIVIERE SALEE - NOUMEA",null,null,"PROVINCE SUD","Académie de Nouvelle-Calédonie",{"$f":"IF(C1=\"\",\"\",VLOOKUP(C1,etab,4,FALSE))","v":"public"}]
["GEBEPS_2014_IPR_PROTOCOLES_public_9830304N.xls",null,null,null,"",null,null,null,{"$f":"Données!M11","v":"V3_29/10/13"}]
[null,"CLASSES            évaluées pour le DNB","NOM \nde l'enseignant responsable de la classe","Activités","Compétences\npropres",null,"dates des évaluations","dates des rattrapages",null,"nbre APSA\n/ classe"]
[null,null,null,null,"CP","Liste"]
["Classe 1","Classe","Mme BET-DRENO","Arts du cirque","CP3","N","2014-04-04","2014-04-25",{"$f":"IF(ISERROR(E5),1,\"\")","v":""},{"$f":"IF(COUNTA(D5:D10)<=2,\"\",COUNTA(D5:D10))","v":3}]
[null,"3èA/3èE",null,"Badminton","CP4","N","2014-07-25","2014-08-01",{"$f":"IF(ISERROR(E6),1,\"\")","v":""}]
[null,null,null,"Multibond","CP1","N","2014-10-10","2014-10-31",""]
[null,"nbre d'élèves :   ",null,null,"","",null,null,""]
[null,22,null,null,"","",null,null,""]
[null,null,null,null,"","",null,null,""]
["Classe 2","Classe","M. GAUTHIER","Relais-vitesse","CP1","N","2014-04-04","2014-04-25","",{"$f":"IF(COUNTA(D11:D16)<=2,\"\",COUNTA(D11:D16))","v":3}]
[null,"3èA/3èE",null,"Volley","CP4","N","2014-07-25","2014-08-01",""]
[null,null,null,"Acrosport","CP3","N","2014-10-10","2014-10-31",""]
[null,"nbre d'élèves :   ",null,null,"","",null,null,""]
[null,20,null,null,"","",null,null,""]
[null,null,null,null,"","",null,null,""]
["Classe 3","Classe","Mme GACON","Multibond","CP1","N","2014-04-29","2014-05-06","",{"$f":"IF(COUNTA(D17:D22)<=2,\"\",COUNTA(D17:D22))","v":3}]
[null,"3èB/3èC",null,"Badminton","CP4","N","2014-07-22","2014-07-29",""]
[null,null,null,"Arts du cirque","CP3","N","2014-10-07","2014-10-28",""]
[null,"nbre d'élèves :   ",null,null,"","",null,null,""]
[null,23,null,null,"","",null,null,""]
[null,null,null,null,"","",null,null,""]
["Classe 4","Classe","M. MAYRAND","Acrosport","CP3","N","2014-04-29","2014-05-06","",{"$f":"IF(COUNTA(D23:D28)<=2,\"\",COUNTA(D23:D28))","v":3}]
[null,"3èB/3èC",null,"Relais-vitesse","CP1","N","2014-07-22","2014-07-29",""]
[null,null,null,"Volley","CP4","N","2014-10-07","2014-10-28",""]
[null,"nbre d'élèves :   ",null,null,"","",null,null,""]
[null,24,null,null,"","",null,null,""]
[null,null,null,null,"","",null,null,""]
["Classe 5","Classe","Mme GACON","Arts du cirque","CP3","N","2014-04-29","2014-05-06","",{"$f":"IF(COUNTA(D29:D34)<=2,\"\",COUNTA(D29:D34))","v":3}]
[null,"3èD/3èF",null,"Badminton","CP4","N","2014-07-22","2014-07-29",""]
[null,null,null,"Multibond","CP1","N","2014-10-07","2014-10-28",""]
[null,"nbre d'élèves :   ",null,null,"","",null,null,""]
[null,24,null,null,"","",null,null,""]
[null,null,null,null,"","",null,null,""]
["Classe 6","Classe","M. GAUTHIER","Volley","CP4","N","2014-04-29","2014-05-06","",{"$f":"IF(COUNTA(D35:D40)<=2,\"\",COUNTA(D35:D40))","v":3}]
[null,"3èD/3èF",null,"Acrosport","CP3","N","2014-07-22","2014-07-29",""]
[null,null,null,"Relais-vitesse","CP1","N","2014-10-07","2014-10-28",""]
[null,"nbre d'élèves :   ",null,null,"","",null,null,""]
[null,23,null,null,"","",null,null,""]
[null,null,null,null,"","",null,null,""]
["Classe 7","Classe","prof7",null,"","",null,null,{"$f":"IF(ISERROR(E41),1,\"\")","v":""},{"$f":"IF(COUNTA(D41:D46)<=2,\"\",COUNTA(D41:D46))","v":""}]
[null,"3è7",null,null,"","",null,null,{"$f":"IF(ISERROR(E42),1,\"\")","v":""}]
[null,null,null,null,"","",null,null,""]
[null,"nbre d'élèves :   ",null,null,"","",null,null,""]
[null,null,null,null,"","",null,null,""]
[null,null,null,null,"","",null,null,""]
["Classe 8","Classe","prof8",null,"","",null,null,"",{"$f":"IF(COUNTA(D47:D52)<=2,\"\",COUNTA(D47:D52))","v":""}]
[null,"3è8",null,null,"","",null,null,""]
[null,null,null,null,"","",null,null,""]
[null,"nbre d'élèves :   ",null,null,"","",null,null,""]
[null,null,null,null,"","",null,null,""]
[null,null,null,null,"","",null,null,""]
["Classe 9","Classe","prof9",null,"","",null,null,"",{"$f":"IF(COUNTA(D53:D58)<=2,\"\",COUNTA(D53:D58))","v":""}]
[null,"3è9",null,null,"","",null,null,""]
[null,null,null,null,"","",null,null,""]
[null,"nbre d'élèves :   ",null,null,"","",null,null,""]
[null,null,null,null,"","",null,null,""]
[null,null,null,null,"","",null,null,""]
["Classe 10","Classe","prof10",null,"","",null,null,"",{"$f":"IF(COUNTA(D59:D64)<=2,\"\",COUNTA(D59:D64))","v":""}]
[null,"3è10",null,null,"","",null,null,""]
[null,null,null,null,"","",null,null,""]
[null,"nbre d'élèves :   ",null,null,"","",null,null,""]
[null,null,null,null,"","",null,null,""]
[null,null,null,null,"","",null,null,""]
["Classe 11","Classe","prof11",null,"","",null,null,"",{"$f":"IF(COUNTA(D65:D70)<=2,\"\",COUNTA(D65:D70))","v":""}]
[null,"3è11",null,null,"","",null,null,""]
[null,null,null,null,"","",null,null,""]
[null,"nbre d'élèves :   ",null,null,"","",null,null,""]
[null,null,null,null,"","",null,null,""]
[null,null,null,null,"","",null,null,""]
["Classe 12","Classe","prof12",null,"","",null,null,"",{"$f":"IF(COUNTA(D71:D76)<=2,\"\",COUNTA(D71:D76))","v":""}]
[null,"3è12",null,null,"","",null,null,""]
[null,null,null,null,"","",null,null,""]
[null,"nbre d'élèves :   ",null,null,"","",null,null,""]
[null,null,null,null,"","",null,null,""]
[null,null,null,null,"","",null,null,""]
[null,null,null,null,null,null,null,null,{"$f":"IF(COUNT(I5:I76)=0,\"\",\"Attention, une ou plusieurs APSA du protocole sont mal saisies!\")","v":""},{"$f":"AVERAGE(J5:J71)","v":3}]
[null,"Date de validation par le chef d'établissement :",null,null,null,null,"2014-02-25",null,null,{"$f":"COUNT(J5:J71)","v":6}]
[null,"Informations à transmettre à l'inspection :",null,null,null,null,"Fonctionnement en menu"]
[]
[null,null,null,null,null,null,null,null,""]
[]
[null,"Partie reservée à l'inspection :"]

{"sheet":"9830278k","index":32,"n_rows":83,"n_cols":10,"rows_kept":83,"cut":false,"hidden":false,"merged":[[0,3,0,5],[2,1,3,1],[2,2,3,2],[2,3,3,3],[2,4,2,5],[2,7,3,7],[4,0,9,0],[4,2,9,2],[10,0,15,0],[10,2,15,2],[16,0,21,0],[16,2,21,2],[2,6,3,6],[58,0,63,0],[58,2,63,2],[22,0,27,0],[22,2,27,2],[28,0,33,0],[28,2,33,2],[34,0,39,0],[34,2,39,2],[64,0,69,0],[64,2,69,2],[70,0,75,0],[70,2,75,2],[40,0,45,0],[40,2,45,2],[46,0,51,0],[46,2,51,2],[52,0,57,0],[52,2,57,2]]}
["R","DNB 2014","9830278k","CLG DE KONE",null,null,"PROVINCE NORD","Académie de Nouvelle-Calédonie",{"$f":"IF(C1=\"\",\"\",VLOOKUP(C1,etab,4,FALSE))","v":"public"}]
["GEBEPS_2014_IPR_PROTOCOLES_public_9830278k.xls",null,null,null,"",null,null,null,{"$f":"Données!M11","v":"V3_29/10/13"}]
[null,"CLASSES            évaluées pour le DNB","NOM \nde l'enseignant responsable de la classe","Activités","Compétences\npropres",null,"dates des évaluations","dates des rattrapages",null,"nbre APSA\n/ classe"]
[null,null,null,null,"CP","Liste"]
["Classe 1","Classe","soleirol","Volley","CP4","N","2014-04-30","2014-05-07",{"$f":"IF(ISERROR(E5),1,\"\")","v":""},{"$f":"IF(COUNTA(D5:D10)<=2,\"\",COUNTA(D5:D10))","v":3}]
[null,"3è1",null,"Demi-fond","CP1","N","2014-07-23","2014-07-30",{"$f":"IF(ISERROR(E6),1,\"\")","v":""}]
[null,null,null,"Voile","CP2","A","2014-10-29","2014-11-05",""]
[null,"nbre d'élèves :   ",null,null,"","",null,null,""]
[null,24,null,null,"","",null,null,""]
[null,null,null,null,"","",null,null,""]
["Classe 2","Classe","couget","Volley","CP4","N","2014-04-29","2014-05-06","",{"$f":"IF(COUNTA(D11:D16)<=2,\"\",COUNTA(D11:D16))","v":3}]
[null,"3è2",null,"Demi-fond","CP1","N","2014-07-22","2014-07-29",""]
[null,null,null,"Voile","CP2","A","2014-10-28","2014-11-04",""]
[null,"nbre d'élèves :   ",null,null,"","",null,null,""]
[null,23,null,null,"","",null,null,""]
[null,null,null,null,"","",null,null,""]
["Classe 3","Classe","rolly","Volley","CP4","N","2014-04-30","2014-05-07","",{"$f":"IF(COUNTA(D17:D22)<=2,\"\",COUNTA(D17:D22))","v":3}]
[null,"3è3",null,"Demi-fond","CP1","N","2014-07-23","2014-07-30",""]
[null,null,null,"Voile","CP2","A","2014-10-29","2014-11-05",""]
[null,"nbre d'élèves :   ",null,null,"","",null,null,""]
[null,22,null,null,"","",null,null,""]
[null,null,null,null,"","",null,null,""]
["Classe 4","Classe","david","Demi-fond","CP1","N","2014-04-25","2014-05-07","",{"$f":"IF(COUNTA(D23:D28)<=2,\"\",COUNTA(D23:D28))","v":3}]
[null,"3è4",null,"Voile","CP2","A","2014-07-25","2014-08-01",""]
[null,null,null,"Volley","CP4","N","2014-10-31","2014-11-07",""]
[null,"nbre d'élèves :   ",null,null,"","",null,null,""]
[null,23,null,null,"","",null,null,""]
[null,null,null,null,"","",null,null,""]
["Classe 5","Classe","couget","Volley","CP4","N","2014-04-18","2014-05-16","",{"$f":"IF(COUNTA(D29:D34)<=2,\"\",COUNTA(D29:D34))","v":3}]
[null,"3è5",null,"Demi-fond","CP1","N","2014-07-25","2014-08-01",""]
[null,null,null,"Voile","CP2","A","2014-10-31","2014-11-07",""]
[null,"nbre d'élèves :   ",null,null,"","",null,null,""]
[null,25,null,null,"","",null,null,""]
[null,null,null,null,"","",null,null,""]
["Classe 6","Classe","rolly","Volley","CP4","N","2014-04-24","2014-05-15","",{"$f":"IF(COUNTA(D35:D40)<=2,\"\",COUNTA(D35:D40))","v":3}]
[null,"3è6",null,"Demi-fond","CP1","N","2014-10-10","2014-11-07",""]
[null,null,null,"Voile","CP2","A","2014-10-29","2014-11-05",""]
[null,"nbre d'élèves :   ",null,null,"","",null,null,""]
[null,22,null,null,"","",null,null,""]
[null,null,null,null,"","",null,null,""]
["Classe 7","Classe","couget","Voile","CP2","A","2014-04-28","2014-05-05",{"$f":"IF(ISERROR(E41),1,\"\")","v":""},{"$f":"IF(COUNTA(D41:D46)<=2,\"\",COUNTA(D41:D46))","v":3}]
[null,"3è7",null,"Demi-fond","CP1","N","2014-07-21","2014-07-28",{"$f":"IF(ISERROR(E42),1,\"\")","v":""}]
[null,null,null,"Foot","CP4","N","2014-10-27","2014-11-03",""]
[null,"nbre d'élèves :   ",null,null,"","",null,null,""]
[null,21,null,null,"","",null,null,""]
[null,null,null,null,"","",null,null,""]
["Classe 8","Classe","prof8",null,"","",null,null,"",{"$f":"IF(COUNTA(D47:D52)<=2,\"\",COUNTA(D47:D52))","v":""}]
[null,"3è8",null,null,"","",null,null,""]
[null,null,null,null,"","",null,null,""]
[null,"nbre d'élèves :   ",null,null,"","",null,null,""]
[null,null,null,null,"","",null,null,""]
[null,null,null,null,"","",null,null,""]
["Classe 9","Classe","prof9",null,"","",null,null,"",{"$f":"IF(COUNTA(D53:D58)<=2,\"\",COUNTA(D53:D58))","v":""}]
[null,"3è9",null,null,"","",null,null,""]
[null,null,null,null,"","",null,null,""]
[null,"nbre d'élèves :   ",null,null,"","",null,null,""]
[null,null,null,null,"","",null,null,""]
[null,null,null,null,"","",null,null,""]
["Classe 10","Classe","prof10",null,"","",null,null,"",{"$f":"IF(COUNTA(D59:D64)<=2,\"\",COUNTA(D59:D64))","v":""}]
[null,"3è10",null,null,"","",null,null,""]
[null,null,null,null,"","",null,null,""]
[null,"nbre d'élèves :   ",null,null,"","",null,null,""]
[null,null,null,null,"","",null,null,""]
[null,null,null,null,"","",null,null,""]
["Classe 11","Classe","prof11",null,"","",null,null,"",{"$f":"IF(COUNTA(D65:D70)<=2,\"\",COUNTA(D65:D70))","v":""}]
[null,"3è11",null,null,"","",null,null,""]
[null,null,null,null,"","",null,null,""]
[null,"nbre d'élèves :   ",null,null,"","",null,null,""]
[null,null,null,null,"","",null,null,""]
[null,null,null,null,"","",null,null,""]
["Classe 12","Classe","prof12",null,"","",null,null,"",{"$f":"IF(COUNTA(D71:D76)<=2,\"\",COUNTA(D71:D76))","v":""}]
[null,"3è12",null,null,"","",null,null,""]
[null,null,null,null,"","",null,null,""]
[null,"nbre d'élèves :   ",null,null,"","",null,null,""]
[null,null,null,null,"","",null,null,""]
[null,null,null,null,"","",null,null,""]
[null,null,null,null,null,null,null,null,{"$f":"IF(COUNT(I5:I76)=0,\"\",\"Attention, une ou plusieurs APSA du protocole sont mal saisies!\")","v":""},{"$f":"AVERAGE(J5:J71)","v":3}]
[null,"Date de validation par le chef d'établissement :",null,null,null,null,null,null,null,{"$f":"COUNT(J5:J71)","v":7}]
[null,"Informations à transmettre à l'inspection :"]
[]
[null,null,null,null,null,null,null,null,""]
[]
[null,"Partie reservée à l'inspection :"]

{"sheet":"9830277J","index":33,"n_rows":83,"n_cols":10,"rows_kept":83,"cut":false,"hidden":false,"merged":[[2,6,3,6],[2,7,3,7],[4,0,9,0],[4,2,9,2],[0,3,0,5],[2,1,3,1],[2,2,3,2],[2,3,3,3],[2,4,2,5],[22,0,27,0],[22,2,27,2],[28,0,33,0],[28,2,33,2],[10,0,15,0],[10,2,15,2],[16,0,21,0],[16,2,21,2],[46,0,51,0],[46,2,51,2],[52,0,57,0],[52,2,57,2],[34,0,39,0],[34,2,39,2],[40,0,45,0],[40,2,45,2],[70,0,75,0],[70,2,75,2],[58,0,63,0],[58,2,63,2],[64,0,69,0],[64,2,69,2]]}
["R","DNB 2014","9830277J","CLG JEAN MARIOTTI - NOUMEA",null,null,"PROVINCE SUD","Académie de Nouvelle-Calédonie",{"$f":"IF(C1=\"\",\"\",VLOOKUP(C1,etab,4,FALSE))","v":"public"}]
["GEBEPS_2014_IPR_PROTOCOLES_public_9830277J.xls",null,null,null,"",null,null,null,{"$f":"Données!M11","v":"V3_29/10/13"}]
[null,"CLASSES            évaluées pour le DNB","NOM \nde l'enseignant responsable de la classe","Activités","Compétences\npropres",null,"dates des évaluations","dates des rattrapages",null,"nbre APSA\n/ classe"]
[null,null,null,null,"CP","Liste"]
["Classe 1","Classe","CONCHE","Badminton","CP4","N","2014-08-01","2014-11-07",{"$f":"IF(ISERROR(E5),1,\"\")","v":""},{"$f":"IF(COUNTA(D5:D10)<=2,\"\",COUNTA(D5:D10))","v":3}]
[null,"3è1",null,"Natation longue","CP1","N","2014-10-31","2014-11-07",{"$f":"IF(ISERROR(E6),1,\"\")","v":""}]
[null,null,null,"CO","CP2","N","2014-04-04","2014-04-25",""]
[null,"nbre d'élèves :   ",null,null,"","",null,null,""]
[null,28,null,null,"","",null,null,""]
[null,null,null,null,"","",null,null,""]
["Classe 2","Classe","LACHMANN","Badminton","CP4","N","2014-05-05","2014-05-07","",{"$f":"IF(COUNTA(D11:D16)<=2,\"\",COUNTA(D11:D16))","v":3}]
[null,"3è2",null,"CO","CP2","N","2014-07-28","2014-08-01",""]
[null,null,null,"Natation longue","CP1","N","2014-11-03","2014-11-07",""]
[null,"nbre d'élèves :   ",null,null,"","",null,null,""]
[null,28,null,null,"","",null,null,""]
[null,null,null,null,"","",null,null,""]
["Classe 3","Classe","RAYMONDEAU","Natation longue","CP1","N","2014-04-03","2014-04-24","",{"$f":"IF(COUNTA(D17:D22)<=2,\"\",COUNTA(D17:D22))","v":3}]
[null,"3è3",null,"Badminton","CP4","N","2014-07-24","2014-07-31",""]
[null,null,null,"CO","CP2","N","2014-09-29","2014-10-27",""]
[null,"nbre d'élèves :   ",null,null,"","",null,null,""]
[null,28,null,null,"","",null,null,""]
[null,null,null,null,"","",null,null,""]
["Classe 4","Classe","PAGE","Badminton","CP4","N","2014-04-04","2014-04-25","",{"$f":"IF(COUNTA(D23:D28)<=2,\"\",COUNTA(D23:D28))","v":3}]
[null,"3è4",null,"CO","CP2","N","2014-08-08","2014-08-29",""]
[null,null,null,"Natation longue","CP1","N","2014-10-31","2014-11-04",""]
[null,"nbre d'élèves :   ",null,null,"","",null,null,""]
[null,29,null,null,"","",null,null,""]
[null,null,null,null,"","",null,null,""]
["Classe 5","Classe","BERTHELOT","Natation longue","CP1","N","2014-07-24","2014-07-31","",{"$f":"IF(COUNTA(D29:D34)<=2,\"\",COUNTA(D29:D34))","v":3}]
[null,"3è5",null,"CO","CP2","N","2014-10-07","2014-10-14",""]
[null,null,null,"Badminton","CP4","N","2014-10-30","2014-11-06",""]
[null,"nbre d'élèves :   ",null,null,"","",null,null,""]
[null,26,null,null,"","",null,null,""]
[null,null,null,null,"","",null,null,""]
["Classe 6","Classe","NICKLES","Badminton","CP4","N","2014-07-31","2014-08-07","",{"$f":"IF(COUNTA(D35:D40)<=2,\"\",COUNTA(D35:D40))","v":3}]
[null,"3è6",null,"CO","CP2","N","2014-07-28","2014-09-04",""]
[null,null,null,"Natation longue","CP1","N","2014-10-30","2014-11-06",""]
[null,"nbre d'élèves :   ",null,null,"","",null,null,""]
[null,28,null,null,"","",null,null,""]
[null,null,null,null,"","",null,null,""]
["Classe 7","Classe","RAYMONDEAU","Badminton","CP4","N","2014-06-30","2014-07-21",{"$f":"IF(ISERROR(E41),1,\"\")","v":""},{"$f":"IF(COUNTA(D41:D46)<=2,\"\",COUNTA(D41:D46))","v":3}]
[null,"3è7",null,"CO","CP2","N","2014-04-04","2014-04-25",{"$f":"IF(ISERROR(E42),1,\"\")","v":""}]
[null,null,null,"Natation longue","CP1","N","2014-10-31","2014-11-07",""]
[null,"nbre d'élèves :   ",null,null,"","",null,null,""]
[null,29,null,null,"","",null,null,""]
[null,null,null,null,"","",null,null,""]
["Classe 8","Classe","PAGE","Badminton","CP4","N","2014-04-03","2014-04-24","",{"$f":"IF(COUNTA(D47:D52)<=2,\"\",COUNTA(D47:D52))","v":3}]
[null,"3è8",null,"Natation longue","CP1","N","2014-07-10","2014-11-07",""]
[null,null,null,"CO","CP2","N","2014-10-08","2014-10-30",""]
[null,"nbre d'élèves :   ",null,null,"","",null,null,""]
[null,27,null,null,"","",null,null,""]
[null,null,null,null,"","",null,null,""]
["Classe 9","Classe","prof9",null,"","",null,null,"",{"$f":"IF(COUNTA(D53:D58)<=2,\"\",COUNTA(D53:D58))","v":""}]
[null,"3è9",null,null,"","",null,null,""]
[null,null,null,null,"","",null,null,""]
[null,"nbre d'élèves :   ",null,null,"","",null,null,""]
[null,null,null,null,"","",null,null,""]
[null,null,null,null,"","",null,null,""]
["Classe 10","Classe","prof10",null,"","",null,null,"",{"$f":"IF(COUNTA(D59:D64)<=2,\"\",COUNTA(D59:D64))","v":""}]
[null,"3è10",null,null,"","",null,null,""]
[null,null,null,null,"","",null,null,""]
[null,"nbre d'élèves :   ",null,null,"","",null,null,""]
[null,null,null,null,"","",null,null,""]
[null,null,null,null,"","",null,null,""]
["Classe 11","Classe","prof11",null,"","",null,null,"",{"$f":"IF(COUNTA(D65:D70)<=2,\"\",COUNTA(D65:D70))","v":""}]
[null,"3è11",null,null,"","",null,null,""]
[null,null,null,null,"","",null,null,""]
[null,"nbre d'élèves :   ",null,null,"","",null,null,""]
[null,null,null,null,"","",null,null,""]
[null,null,null,null,"","",null,null,""]
["Classe 12","Classe","prof12",null,"","",null,null,"",{"$f":"IF(COUNTA(D71:D76)<=2,\"\",COUNTA(D71:D76))","v":""}]
[null,"3è12",null,null,"","",null,null,""]
[null,null,null,null,"","",null,null,""]
[null,"nbre d'élèves :   ",null,null,"","",null,null,""]
[null,null,null,null,"","",null,null,""]
[null,null,null,null,"","",null,null,""]
[null,null,null,null,null,null,null,null,{"$f":"IF(COUNT(I5:I76)=0,\"\",\"Attention, une ou plusieurs APSA du protocole sont mal saisies!\")","v":""},{"$f":"AVERAGE(J5:J71)","v":3}]
[null,"Date de validation par le chef d'établissement :",null,null,null,null,null,null,null,{"$f":"COUNT(J5:J71)","v":8}]
[null,"Informations à transmettre à l'inspection :"]
[]
[null,null,null,null,null,null,null,null,""]
[]
[null,"Partie reservée à l'inspection :"]

{"sheet":"9830010U","index":34,"n_rows":83,"n_cols":10,"rows_kept":83,"cut":false,"hidden":false,"merged":[[64,0,69,0],[64,2,69,2],[70,0,75,0],[70,2,75,2],[40,0,45,0],[40,2,45,2],[46,0,51,0],[46,2,51,2],[52,0,57,0],[34,0,39,0],[52,2,57,2],[16,0,21,0],[16,2,21,2],[2,6,3,6],[34,2,39,2],[4,0,9,0],[4,2,9,2],[10,0,15,0],[10,2,15,2],[58,0,63,0],[58,2,63,2],[22,0,27,0],[22,2,27,2],[28,0,33,0],[28,2,33,2],[0,3,0,5],[2,1,3,1],[2,2,3,2],[2,3,3,3],[2,4,2,5],[2,7,3,7]]}
["R","DNB 2014","9830010U","CLG LOUIS LEOPOLD DJIET ET SEGPA - BOURAIL",null,null,"PROVINCE SUD","Académie de Nouvelle-Calédonie",{"$f":"IF(C1=\"\",\"\",VLOOKUP(C1,etab,4,FALSE))","v":"public"}]
["GEBEPS_2014_IPR_PROTOCOLES_public_9830010U.xls",null,null,null,"",null,null,null,{"$f":"Données!M11","v":"V3_29/10/13"}]
[null,"CLASSES            évaluées pour le DNB","NOM \nde l'enseignant responsable de la classe","Activités","Compétences\npropres",null,"dates des évaluations","dates des rattrapages",null,"nbre APSA\n/ classe"]
[null,null,null,null,"CP","Liste"]
["Classe 1","Classe","ULRICH.C","Demi-fond","CP1","N","2014-07-23","2014-07-30",{"$f":"IF(ISERROR(E5),1,\"\")","v":""},{"$f":"IF(COUNTA(D5:D10)<=2,\"\",COUNTA(D5:D10))","v":4}]
[null,"3èA",null,"Badminton","CP4","N","2014-07-25","2014-08-01",{"$f":"IF(ISERROR(E6),1,\"\")","v":""}]
[null,null,null,"Hand","CP4","N","2014-04-21","2014-04-28",""]
[null,"nbre d'élèves :   ",null,"Va'a","CP2","A","2014-10-31","2014-11-07",""]
[null,25,null,null,"","",null,null,""]
[null,null,null,null,"","",null,null,""]
["Classe 2","Classe","LE BORGNE. D","Demi-fond","CP1","N","2014-07-21","2014-04-28","",{"$f":"IF(COUNTA(D11:D16)<=2,\"\",COUNTA(D11:D16))","v":4}]
[null,"3èB",null,"Badminton","CP4","N","30/11§14","2014-11-06",""]
[null,null,null,"Hand","CP4","N","2014-04-03","2014-04-24",""]
[null,"nbre d'élèves :   ",null,"Va'a","CP2","A","2014-07-24","2014-07-31",""]
[null,25,null,null,"","",null,null,""]
[null,null,null,null,"","",null,null,""]
["Classe 3","Classe","PELLERIN. C","Demi-fond","CP1","N","2014-07-23","2014-07-30","",{"$f":"IF(COUNTA(D17:D22)<=2,\"\",COUNTA(D17:D22))","v":4}]
[null,"3èC",null,"Badminton","CP4","N","2014-07-21","2014-07-28",""]
[null,null,null,"Hand","CP4","N","2014-10-29","2014-11-05",""]
[null,"nbre d'élèves :   ",null,"Va'a","CP2","A","2014-10-27","2014-11-03",""]
[null,17,null,null,"","",null,null,""]
[null,null,null,null,"","",null,null,""]
["Classe 4","Classe","prof4",null,"","",null,null,"",{"$f":"IF(COUNTA(D23:D28)<=2,\"\",COUNTA(D23:D28))","v":""}]
[null,"3è4",null,null,"","",null,null,""]
[null,null,null,null,"","",null,null,""]
[null,"nbre d'élèves :   ",null,null,"","",null,null,""]
[null,null,null,null,"","",null,null,""]
[null,null,null,null,"","",null,null,""]
["Classe 5","Classe","prof5",null,"","",null,null,"",{"$f":"IF(COUNTA(D29:D34)<=2,\"\",COUNTA(D29:D34))","v":""}]
[null,"3è5",null,null,"","",null,null,""]
[null,null,null,null,"","",null,null,""]
[null,"nbre d'élèves :   ",null,null,"","",null,null,""]
[null,null,null,null,"","",null,null,""]
[null,null,null,null,"","",null,null,""]
["Classe 6","Classe","prof6",null,"","",null,null,"",{"$f":"IF(COUNTA(D35:D40)<=2,\"\",COUNTA(D35:D40))","v":""}]
[null,"3è6",null,null,"","",null,null,""]
[null,null,null,null,"","",null,null,""]
[null,"nbre d'élèves :   ",null,null,"","",null,null,""]
[null,null,null,null,"","",null,null,""]
[null,null,null,null,"","",null,null,""]
["Classe 7","Classe","prof7",null,"","",null,null,{"$f":"IF(ISERROR(E41),1,\"\")","v":""},{"$f":"IF(COUNTA(D41:D46)<=2,\"\",COUNTA(D41:D46))","v":""}]
[null,"3è7",null,null,"","",null,null,{"$f":"IF(ISERROR(E42),1,\"\")","v":""}]
[null,null,null,null,"","",null,null,""]
[null,"nbre d'élèves :   ",null,null,"","",null,null,""]
[null,null,null,null,"","",null,null,""]
[null,null,null,null,"","",null,null,""]
["Classe 8","Classe","prof8",null,"","",null,null,"",{"$f":"IF(COUNTA(D47:D52)<=2,\"\",COUNTA(D47:D52))","v":""}]
[null,"3è8",null,null,"","",null,null,""]
[null,null,null,null,"","",null,null,""]
[null,"nbre d'élèves :   ",null,null,"","",null,null,""]
[null,null,null,null,"","",null,null,""]
[null,null,null,null,"","",null,null,""]
["Classe 9","Classe","prof9",null,"","",null,null,"",{"$f":"IF(COUNTA(D53:D58)<=2,\"\",COUNTA(D53:D58))","v":""}]
[null,"3è9",null,null,"","",null,null,""]
[null,null,null,null,"","",null,null,""]
[null,"nbre d'élèves :   ",null,null,"","",null,null,""]
[null,null,null,null,"","",null,null,""]
[null,null,null,null,"","",null,null,""]
["Classe 10","Classe","prof10",null,"","",null,null,"",{"$f":"IF(COUNTA(D59:D64)<=2,\"\",COUNTA(D59:D64))","v":""}]
[null,"3è10",null,null,"","",null,null,""]
[null,null,null,null,"","",null,null,""]
[null,"nbre d'élèves :   ",null,null,"","",null,null,""]
[null,null,null,null,"","",null,null,""]
[null,null,null,null,"","",null,null,""]
["Classe 11","Classe","prof11",null,"","",null,null,"",{"$f":"IF(COUNTA(D65:D70)<=2,\"\",COUNTA(D65:D70))","v":""}]
[null,"3è11",null,null,"","",null,null,""]
[null,null,null,null,"","",null,null,""]
[null,"nbre d'élèves :   ",null,null,"","",null,null,""]
[null,null,null,null,"","",null,null,""]
[null,null,null,null,"","",null,null,""]
["Classe 12","Classe","prof12",null,"","",null,null,"",{"$f":"IF(COUNTA(D71:D76)<=2,\"\",COUNTA(D71:D76))","v":""}]
[null,"3è12",null,null,"","",null,null,""]
[null,null,null,null,"","",null,null,""]
[null,"nbre d'élèves :   ",null,null,"","",null,null,""]
[null,null,null,null,"","",null,null,""]
[null,null,null,null,"","",null,null,""]
[null,null,null,null,null,null,null,null,{"$f":"IF(COUNT(I5:I76)=0,\"\",\"Attention, une ou plusieurs APSA du protocole sont mal saisies!\")","v":""},{"$f":"AVERAGE(J5:J71)","v":4}]
[null,"Date de validation par le chef d'établissement :",null,null,null,null,null,null,null,{"$f":"COUNT(J5:J71)","v":3}]
[null,"Informations à transmettre à l'inspection :"]
[]
[null,null,null,null,null,null,null,null,""]
[]
[null,"Partie reservée à l'inspection :"]

{"sheet":"9830009T","index":35,"n_rows":83,"n_cols":10,"rows_kept":83,"cut":false,"hidden":false,"merged":[[64,0,69,0],[64,2,69,2],[70,0,75,0],[70,2,75,2],[46,0,51,0],[46,2,51,2],[52,0,57,0],[52,2,57,2],[58,0,63,0],[58,2,63,2],[22,0,27,0],[22,2,27,2],[28,0,33,0],[28,2,33,2],[34,0,39,0],[34,2,39,2],[40,0,45,0],[40,2,45,2],[4,0,9,0],[4,2,9,2],[10,0,15,0],[10,2,15,2],[16,0,21,0],[16,2,21,2],[0,3,0,5],[2,1,3,1],[2,2,3,2],[2,3,3,3],[2,4,2,5],[2,7,3,7],[2,6,3,6]]}
["R","DNB 2014","9830009T","CLG DE LA FOA",null,null,"PROVINCE SUD","Académie de Nouvelle-Calédonie",{"$f":"IF(C1=\"\",\"\",VLOOKUP(C1,etab,4,FALSE))","v":"public"}]
["GEBEPS_2014_IPR_PROTOCOLES_public_9830009T.xls",null,null,null,"",null,null,null,{"$f":"Données!M11","v":"V3_29/10/13"}]
[null,"CLASSES            évaluées pour le DNB","NOM \nde l'enseignant responsable de la classe","Activités","Compétences\npropres",null,"dates des évaluations","dates des rattrapages",null,"nbre APSA\n/ classe"]
[null,null,null,null,"CP","Liste"]
["Classe 1","Classe","FAGUER","Acrosport","CP3","N","2014-04-24","2014-04-30",{"$f":"IF(ISERROR(E5),1,\"\")","v":""},{"$f":"IF(COUNTA(D5:D10)<=2,\"\",COUNTA(D5:D10))","v":3}]
[null,"3è1",null,"Badminton","CP4","N","2014-07-24","2014-07-31",{"$f":"IF(ISERROR(E6),1,\"\")","v":""}]
[null,null,null,"CO","CP2","N","2014-10-30","2014-11-06",""]
[null,"nbre d'élèves :   ",null,null,"","",null,null,""]
[null,24,null,null,"","",null,null,""]
[null,null,null,null,"","",null,null,""]
["Classe 2","Classe","FAGUER","Acrosport","CP3","N","2014-05-05","2014-05-07","",{"$f":"IF(COUNTA(D11:D16)<=2,\"\",COUNTA(D11:D16))","v":3}]
[null,"3è2",null,"Badminton","CP4","N","2014-07-28","2014-07-30",""]
[null,null,null,"CO","CP2","N","2014-11-03","2014-11-05",""]
[null,"nbre d'élèves :   ",null,null,"","",null,null,""]
[null,24,null,null,"","",null,null,""]
[null,null,null,null,"","",null,null,""]
["Classe 3","Classe","LEBORGNE","Acrosport","CP3","N","2014-04-23","2014-04-30","",{"$f":"IF(COUNTA(D17:D22)<=2,\"\",COUNTA(D17:D22))","v":3}]
[null,"3è3",null,"Badminton","CP4","N","2014-07-24","2014-07-30",""]
[null,null,null,"CO","CP2","N","2014-10-30","2014-11-05",""]
[null,"nbre d'élèves :   ",null,null,"","",null,null,""]
[null,26,null,null,"","",null,null,""]
[null,null,null,null,"","",null,null,""]
["Classe 4","Classe","GRUMAUD","CO","CP2","N","2014-04-25","2014-04-29","",{"$f":"IF(COUNTA(D23:D28)<=2,\"\",COUNTA(D23:D28))","v":3}]
[null,"3è4",null,"Badminton","CP4","N","2014-07-25","2014-08-01",""]
[null,null,null,"Acrosport","CP3","N","2014-10-31","2014-11-07",""]
[null,"nbre d'élèves :   ",null,null,"","",null,null,""]
[null,21,null,null,"","",null,null,""]
[null,null,null,null,"","",null,null,""]
["Classe 5","Classe","prof5",null,"","",null,null,"",{"$f":"IF(COUNTA(D29:D34)<=2,\"\",COUNTA(D29:D34))","v":""}]
[null,"3è5",null,null,"","",null,null,""]
[null,null,null,null,"","",null,null,""]
[null,"nbre d'élèves :   ",null,null,"","",null,null,""]
[null,null,null,null,"","",null,null,""]
[null,null,null,null,"","",null,null,""]
["Classe 6","Classe","prof6",null,"","",null,null,"",{"$f":"IF(COUNTA(D35:D40)<=2,\"\",COUNTA(D35:D40))","v":""}]
[null,"3è6",null,null,"","",null,null,""]
[null,null,null,null,"","",null,null,""]
[null,"nbre d'élèves :   ",null,null,"","",null,null,""]
[null,null,null,null,"","",null,null,""]
[null,null,null,null,"","",null,null,""]
["Classe 7","Classe","prof7",null,"","",null,null,{"$f":"IF(ISERROR(E41),1,\"\")","v":""},{"$f":"IF(COUNTA(D41:D46)<=2,\"\",COUNTA(D41:D46))","v":""}]
[null,"3è7",null,null,"","",null,null,{"$f":"IF(ISERROR(E42),1,\"\")","v":""}]
[null,null,null,null,"","",null,null,""]
[null,"nbre d'élèves :   ",null,null,"","",null,null,""]
[null,null,null,null,"","",null,null,""]
[null,null,null,null,"","",null,null,""]
["Classe 8","Classe","prof8",null,"","",null,null,"",{"$f":"IF(COUNTA(D47:D52)<=2,\"\",COUNTA(D47:D52))","v":""}]
[null,"3è8",null,null,"","",null,null,""]
[null,null,null,null,"","",null,null,""]
[null,"nbre d'élèves :   ",null,null,"","",null,null,""]
[null,null,null,null,"","",null,null,""]
[null,null,null,null,"","",null,null,""]
["Classe 9","Classe","prof9",null,"","",null,null,"",{"$f":"IF(COUNTA(D53:D58)<=2,\"\",COUNTA(D53:D58))","v":""}]
[null,"3è9",null,null,"","",null,null,""]
[null,null,null,null,"","",null,null,""]
[null,"nbre d'élèves :   ",null,null,"","",null,null,""]
[null,null,null,null,"","",null,null,""]
[null,null,null,null,"","",null,null,""]
["Classe 10","Classe","prof10",null,"","",null,null,"",{"$f":"IF(COUNTA(D59:D64)<=2,\"\",COUNTA(D59:D64))","v":""}]
[null,"3è10",null,null,"","",null,null,""]
[null,null,null,null,"","",null,null,""]
[null,"nbre d'élèves :   ",null,null,"","",null,null,""]
[null,null,null,null,"","",null,null,""]
[null,null,null,null,"","",null,null,""]
["Classe 11","Classe","prof11",null,"","",null,null,"",{"$f":"IF(COUNTA(D65:D70)<=2,\"\",COUNTA(D65:D70))","v":""}]
[null,"3è11",null,null,"","",null,null,""]
[null,null,null,null,"","",null,null,""]
[null,"nbre d'élèves :   ",null,null,"","",null,null,""]
[null,null,null,null,"","",null,null,""]
[null,null,null,null,"","",null,null,""]
["Classe 12","Classe","prof12",null,"","",null,null,"",{"$f":"IF(COUNTA(D71:D76)<=2,\"\",COUNTA(D71:D76))","v":""}]
[null,"3è12",null,null,"","",null,null,""]
[null,null,null,null,"","",null,null,""]
[null,"nbre d'élèves :   ",null,null,"","",null,null,""]
[null,null,null,null,"","",null,null,""]
[null,null,null,null,"","",null,null,""]
[null,null,null,null,null,null,null,null,{"$f":"IF(COUNT(I5:I76)=0,\"\",\"Attention, une ou plusieurs APSA du protocole sont mal saisies!\")","v":""},{"$f":"AVERAGE(J5:J71)","v":3}]
[null,"Date de validation par le chef d'établissement :",null,null,null,null,null,null,null,{"$f":"COUNT(J5:J71)","v":4}]
[null,"Informations à transmettre à l'inspection :"]
[]
[null,null,null,null,null,null,null,null,""]
[]
[null,"Partie reservée à l'inspection :"]

{"sheet":"9830008S","index":36,"n_rows":83,"n_cols":10,"rows_kept":83,"cut":false,"hidden":false,"merged":[[0,3,0,5],[2,1,3,1],[2,2,3,2],[2,3,3,3],[2,4,2,5],[2,7,3,7],[4,0,9,0],[4,2,9,2],[10,0,15,0],[10,2,15,2],[16,0,21,0],[16,2,21,2],[2,6,3,6],[58,0,63,0],[58,2,63,2],[22,0,27,0],[22,2,27,2],[28,0,33,0],[28,2,33,2],[34,0,39,0],[34,2,39,2],[64,0,69,0],[64,2,69,2],[70,0,75,0],[70,2,75,2],[40,0,45,0],[40,2,45,2],[46,0,51,0],[46,2,51,2],[52,0,57,0],[52,2,57,2]]}
["R","DNB 2014","9830008S","CLG RAYMOND VAUTHIER ET SEGPA - POINDIMIE",null,null,"PROVINCE NORD","Académie de Nouvelle-Calédonie",{"$f":"IF(C1=\"\",\"\",VLOOKUP(C1,etab,4,FALSE))","v":"public"}]
["GEBEPS_2014_IPR_PROTOCOLES_public_9830008S.xls",null,null,null,"",null,null,null,{"$f":"Données!M11","v":"V3_29/10/13"}]
[null,"CLASSES            évaluées pour le DNB","NOM \nde l'enseignant responsable de la classe","Activités","Compétences\npropres",null,"dates des évaluations","dates des rattrapages",null,"nbre APSA\n/ classe"]
[null,null,null,null,"CP","Liste"]
["Classe 1","Classe","Mr Jainin","Natation Longue","CP1","N","2014-10-27","2014-11-03",{"$f":"IF(ISERROR(E5),1,\"\")","v":""},{"$f":"IF(COUNTA(D5:D10)<=2,\"\",COUNTA(D5:D10))","v":3}]
[null,"3èA",null,"AcroSport","CP3","N","2014-07-25","2014-08-01",{"$f":"IF(ISERROR(E6),1,\"\")","v":""}]
[null,null,null,"Badminton","CP4","N","2014-04-04","2014-04-25",""]
[null,"nbre d'élèves :   ",null,null,"","",null,null,""]
[null,20,null,null,"","",null,null,""]
[null,null,null,null,"","",null,null,""]
["Classe 2","Classe","Mme Valentini","Badminton","CP4","N","2014-04-22","2014-04-29","",{"$f":"IF(COUNTA(D11:D16)<=2,\"\",COUNTA(D11:D16))","v":3}]
[null,"3èB",null,"Natation Longue","CP1","N","2014-10-28","2014-11-04",""]
[null,null,null,"Arts du cirque","CP3","N","2014-07-22","2014-07-29",""]
[null,"nbre d'élèves :   ",null,null,"","",null,null,""]
[null,null,null,null,"","",null,null,""]
[null,20,null,null,"","",null,null,""]
["Classe 3","Classe","Mr Gesland","Hand","CP4","N","2014-04-28","2014-05-05","",{"$f":"IF(COUNTA(D17:D22)<=2,\"\",COUNTA(D17:D22))","v":3}]
[null,"3èC",null,"AcroSport","CP3","N","2014-07-21","2014-07-28",""]
[null,null,null,"Natation Longue","CP1","N","2014-10-27","2014-11-03",""]
[null,"nbre d'élèves :   ",null,null,"","",null,null,""]
[null,21,null,null,"","",null,null,""]
[null,null,null,null,"","",null,null,""]
["Classe 4","Classe","Mme Beaufils","Badminton","CP4","N","2014-04-03","2014-04-24","",{"$f":"IF(COUNTA(D23:D28)<=2,\"\",COUNTA(D23:D28))","v":3}]
[null,"3èD",null,"AcroSport","CP3","N","2014-07-24","2014-07-31",""]
[null,null,null,"Natation Longue","CP1","N","2014-10-30","2014-11-06",""]
[null,"nbre d'élèves :   ",null,null,"","",null,null,""]
[null,null,null,null,"","",null,null,""]
[null,null,null,null,"","",null,null,""]
["Classe 5","Classe","prof5",null,"","",null,null,"",{"$f":"IF(COUNTA(D29:D34)<=2,\"\",COUNTA(D29:D34))","v":""}]
[null,"3è5",null,null,"","",null,null,""]
[null,null,null,null,"","",null,null,""]
[null,"nbre d'élèves :   ",null,null,"","",null,null,""]
[null,null,null,null,"","",null,null,""]
[null,null,null,null,"","",null,null,""]
["Classe 6","Classe","prof6",null,"","",null,null,"",{"$f":"IF(COUNTA(D35:D40)<=2,\"\",COUNTA(D35:D40))","v":""}]
[null,"3è6",null,null,"","",null,null,""]
[null,null,null,null,"","",null,null,""]
[null,"nbre d'élèves :   ",null,null,"","",null,null,""]
[null,null,null,null,"","",null,null,""]
[null,null,null,null,"","",null,null,""]
["Classe 7","Classe","prof7",null,"","",null,null,{"$f":"IF(ISERROR(E41),1,\"\")","v":""},{"$f":"IF(COUNTA(D41:D46)<=2,\"\",COUNTA(D41:D46))","v":""}]
[null,"3è7",null,null,"","",null,null,{"$f":"IF(ISERROR(E42),1,\"\")","v":""}]
[null,null,null,null,"","",null,null,""]
[null,"nbre d'élèves :   ",null,null,"","",null,null,""]
[null,null,null,null,"","",null,null,""]
[null,null,null,null,"","",null,null,""]
["Classe 8","Classe","prof8",null,"","",null,null,"",{"$f":"IF(COUNTA(D47:D52)<=2,\"\",COUNTA(D47:D52))","v":""}]
[null,"3è8",null,null,"","",null,null,""]
[null,null,null,null,"","",null,null,""]
[null,"nbre d'élèves :   ",null,null,"","",null,null,""]
[null,null,null,null,"","",null,null,""]
[null,null,null,null,"","",null,null,""]
["Classe 9","Classe","prof9",null,"","",null,null,"",{"$f":"IF(COUNTA(D53:D58)<=2,\"\",COUNTA(D53:D58))","v":""}]
[null,"3è9",null,null,"","",null,null,""]
[null,null,null,null,"","",null,null,""]
[null,"nbre d'élèves :   ",null,null,"","",null,null,""]
[null,null,null,null,"","",null,null,""]
[null,null,null,null,"","",null,null,""]
["Classe 10","Classe","prof10",null,"","",null,null,"",{"$f":"IF(COUNTA(D59:D64)<=2,\"\",COUNTA(D59:D64))","v":""}]
[null,"3è10",null,null,"","",null,null,""]
[null,null,null,null,"","",null,null,""]
[null,"nbre d'élèves :   ",null,null,"","",null,null,""]
[null,null,null,null,"","",null,null,""]
[null,null,null,null,"","",null,null,""]
["Classe 11","Classe","prof11",null,"","",null,null,"",{"$f":"IF(COUNTA(D65:D70)<=2,\"\",COUNTA(D65:D70))","v":""}]
[null,"3è11",null,null,"","",null,null,""]
[null,null,null,null,"","",null,null,""]
[null,"nbre d'élèves :   ",null,null,"","",null,null,""]
[null,null,null,null,"","",null,null,""]
[null,null,null,null,"","",null,null,""]
["Classe 12","Classe","prof12",null,"","",null,null,"",{"$f":"IF(COUNTA(D71:D76)<=2,\"\",COUNTA(D71:D76))","v":""}]
[null,"3è12",null,null,"","",null,null,""]
[null,null,null,null,"","",null,null,""]
[null,"nbre d'élèves :   ",null,null,"","",null,null,""]
[null,null,null,null,"","",null,null,""]
[null,null,null,null,"","",null,null,""]
[null,null,null,null,null,null,null,null,{"$f":"IF(COUNT(I5:I76)=0,\"\",\"Attention, une ou plusieurs APSA du protocole sont mal saisies!\")","v":""},{"$f":"AVERAGE(J5:J71)","v":3}]
[null,"Date de validation par le chef d'établissement :",null,null,null,null,null,null,null,{"$f":"COUNT(J5:J71)","v":4}]
[null,"Informations à transmettre à l'inspection :"]
[]
[null,null,null,null,null,null,null,null,""]
[]
[null,"Partie reservée à l'inspection :"]

{"sheet":"9830007R","index":37,"n_rows":83,"n_cols":10,"rows_kept":83,"cut":false,"hidden":false,"merged":[[0,3,0,5],[2,1,3,1],[2,2,3,2],[2,3,3,3],[2,4,2,5],[2,7,3,7],[4,0,9,0],[4,2,9,2],[10,0,15,0],[10,2,15,2],[16,0,21,0],[16,2,21,2],[2,6,3,6],[58,0,63,0],[58,2,63,2],[22,0,27,0],[22,2,27,2],[28,0,33,0],[28,2,33,2],[34,0,39,0],[34,2,39,2],[64,0,69,0],[64,2,69,2],[70,0,75,0],[70,2,75,2],[40,0,45,0],[40,2,45,2],[46,0,51,0],[46,2,51,2],[52,0,57,0],[52,2,57,2]]}
["R","DNB 2014","9830007R","CLG DE KOUMAC ET SEGPA",null,null,"PROVINCE NORD","Académie de Nouvelle-Calédonie",{"$f":"IF(C1=\"\",\"\",VLOOKUP(C1,etab,4,FALSE))","v":"public"}]
["GEBEPS_2014_IPR_PROTOCOLES_public_9830007R.xls",null,null,null,"",null,null,null,{"$f":"Données!M11","v":"V3_29/10/13"}]
[null,"CLASSES            évaluées pour le DNB","NOM \nde l'enseignant responsable de la classe","Activités","Compétences\npropres",null,"dates des évaluations","dates des rattrapages",null,"nbre APSA\n/ classe"]
[null,null,null,null,"CP","Liste"]
["Classe 1","Classe","SALMON J","Volley","CP4","N","2014-05-05","2014-05-12",{"$f":"IF(ISERROR(E5),1,\"\")","v":""},{"$f":"IF(COUNTA(D5:D10)<=2,\"\",COUNTA(D5:D10))","v":4}]
[null,"3è1",null,"Demi-fond","CP1","N","2014-07-28","2014-08-04",{"$f":"IF(ISERROR(E6),1,\"\")","v":""}]
[null,null,null,"Tennis de table","CP4","N","2014-08-01","2014-08-08",""]
[null,"nbre d'élèves :   ",null,"Gymnastique sportive","CP3","N","2014-10-31","2014-11-07",""]
[null,26,null,null,"","",null,null,""]
[null,null,null,null,"","",null,null,""]
["Classe 2","Classe","SALMON J","Volley","CP4","N","2014-05-05","2014-05-12","",{"$f":"IF(COUNTA(D11:D16)<=2,\"\",COUNTA(D11:D16))","v":4}]
[null,"3è2",null,"Tennis de table","CP4","N","2014-07-31","2014-08-07",""]
[null,null,null,"Demi-fond","CP1","N","2014-07-28","2014-08-04",""]
[null,"nbre d'élèves :   ",null,"Gymnastique sportive","CP3","N","2014-10-27","2014-11-03",""]
[null,26,null,null,"","",null,null,""]
[null,null,null,null,"","",null,null,""]
["Classe 3","Classe","MULIAVA L","Volley","CP4","N","2014-05-02","2014-05-09","",{"$f":"IF(COUNTA(D17:D22)<=2,\"\",COUNTA(D17:D22))","v":4}]
[null,"3è3",null,"Demi-fond","CP1","N","2014-07-30","2014-08-06",""]
[null,null,null,"Gymnastique sportive","CP3","N","2014-08-01","2014-08-08",""]
[null,"nbre d'élèves :   ",null,"Tennis de table","CP4","N","2014-10-31","2014-11-07",""]
[null,18,null,null,"","",null,null,""]
[null,null,null,null,"","",null,null,""]
["Classe 4","Classe","SALMON S","Volley","CP4","N","2014-05-07","2014-05-14","",{"$f":"IF(COUNTA(D23:D28)<=2,\"\",COUNTA(D23:D28))","v":3}]
[null,"3èDP",null,"Demi-fond","CP1","N","2014-07-30","2014-08-06",""]
[null,null,null,"Tennis de table","CP4","N","2014-10-29","2014-11-05",""]
[null,"nbre d'élèves :   ",null,null,"","",null,null,""]
[null,11,null,null,"","",null,null,""]
[null,null,null,null,"","",null,null,""]
["Classe 5","Classe","prof5",null,"","",null,null,"",{"$f":"IF(COUNTA(D29:D34)<=2,\"\",COUNTA(D29:D34))","v":""}]
[null,"3è5",null,null,"","",null,null,""]
[null,null,null,null,"","",null,null,""]
[null,"nbre d'élèves :   ",null,null,"","",null,null,""]
[null,null,null,null,"","",null,null,""]
[null,null,null,null,"","",null,null,""]
["Classe 6","Classe","prof6",null,"","",null,null,"",{"$f":"IF(COUNTA(D35:D40)<=2,\"\",COUNTA(D35:D40))","v":""}]
[null,"3è6",null,null,"","",null,null,""]
[null,null,null,null,"","",null,null,""]
[null,"nbre d'élèves :   ",null,null,"","",null,null,""]
[null,null,null,null,"","",null,null,""]
[null,null,null,null,"","",null,null,""]
["Classe 7","Classe","prof7",null,"","",null,null,{"$f":"IF(ISERROR(E41),1,\"\")","v":""},{"$f":"IF(COUNTA(D41:D46)<=2,\"\",COUNTA(D41:D46))","v":""}]
[null,"3è7",null,null,"","",null,null,{"$f":"IF(ISERROR(E42),1,\"\")","v":""}]
[null,null,null,null,"","",null,null,""]
[null,"nbre d'élèves :   ",null,null,"","",null,null,""]
[null,null,null,null,"","",null,null,""]
[null,null,null,null,"","",null,null,""]
["Classe 8","Classe","prof8",null,"","",null,null,"",{"$f":"IF(COUNTA(D47:D52)<=2,\"\",COUNTA(D47:D52))","v":""}]
[null,"3è8",null,null,"","",null,null,""]
[null,null,null,null,"","",null,null,""]
[null,"nbre d'élèves :   ",null,null,"","",null,null,""]
[null,null,null,null,"","",null,null,""]
[null,null,null,null,"","",null,null,""]
["Classe 9","Classe","prof9",null,"","",null,null,"",{"$f":"IF(COUNTA(D53:D58)<=2,\"\",COUNTA(D53:D58))","v":""}]
[null,"3è9",null,null,"","",null,null,""]
[null,null,null,null,"","",null,null,""]
[null,"nbre d'élèves :   ",null,null,"","",null,null,""]
[null,null,null,null,"","",null,null,""]
[null,null,null,null,"","",null,null,""]
["Classe 10","Classe","prof10",null,"","",null,null,"",{"$f":"IF(COUNTA(D59:D64)<=2,\"\",COUNTA(D59:D64))","v":""}]
[null,"3è10",null,null,"","",null,null,""]
[null,null,null,null,"","",null,null,""]
[null,"nbre d'élèves :   ",null,null,"","",null,null,""]
[null,null,null,null,"","",null,null,""]
[null,null,null,null,"","",null,null,""]
["Classe 11","Classe","prof11",null,"","",null,null,"",{"$f":"IF(COUNTA(D65:D70)<=2,\"\",COUNTA(D65:D70))","v":""}]
[null,"3è11",null,null,"","",null,null,""]
[null,null,null,null,"","",null,null,""]
[null,"nbre d'élèves :   ",null,null,"","",null,null,""]
[null,null,null,null,"","",null,null,""]
[null,null,null,null,"","",null,null,""]
["Classe 12","Classe","prof12",null,"","",null,null,"",{"$f":"IF(COUNTA(D71:D76)<=2,\"\",COUNTA(D71:D76))","v":""}]
[null,"3è12",null,null,"","",null,null,""]
[null,null,null,null,"","",null,null,""]
[null,"nbre d'élèves :   ",null,null,"","",null,null,""]
[null,null,null,null,"","",null,null,""]
[null,null,null,null,"","",null,null,""]
[null,null,null,null,null,null,null,null,{"$f":"IF(COUNT(I5:I76)=0,\"\",\"Attention, une ou plusieurs APSA du protocole sont mal saisies!\")","v":""},{"$f":"AVERAGE(J5:J71)","v":3.75}]
[null,"Date de validation par le chef d'établissement :",null,null,null,null,null,null,null,{"$f":"COUNT(J5:J71)","v":4}]
[null,"Informations à transmettre à l'inspection :"]
[]
[null,null,null,null,null,null,null,null,""]
[]
[null,"Partie reservée à l'inspection :"]

{"sheet":"9830004M","index":38,"n_rows":83,"n_cols":10,"rows_kept":83,"cut":false,"hidden":false,"merged":[[70,0,75,0],[70,2,75,2],[58,0,63,0],[58,2,63,2],[64,0,69,0],[64,2,69,2],[40,0,45,0],[40,2,45,2],[46,0,51,0],[46,2,51,2],[52,0,57,0],[52,2,57,2],[22,0,27,0],[22,2,27,2],[28,0,33,0],[28,2,33,2],[34,0,39,0],[34,2,39,2],[2,7,3,7],[4,0,9,0],[4,2,9,2],[10,0,15,0],[10,2,15,2],[16,0,21,0],[16,2,21,2],[0,3,0,5],[2,1,3,1],[2,2,3,2],[2,3,3,3],[2,4,2,5],[2,6,3,6]]}
["R","DNB 2014","9830004M","CLG GEORGES BAUDOUX - NOUMEA",null,null,"PROVINCE SUD","Académie de Nouvelle-Calédonie",{"$f":"IF(C1=\"\",\"\",VLOOKUP(C1,etab,4,FALSE))","v":"public"}]
["GEBEPS_2014_IPR_PROTOCOLES_public_9830004M.xls",null,null,null,"",null,null,null,{"$f":"Données!M11","v":"V3_29/10/13"}]
[null,"CLASSES            évaluées pour le DNB","NOM \nde l'enseignant responsable de la classe","Activités","Compétences\npropres",null,"dates des évaluations","dates des rattrapages",null,"nbre APSA\n/ classe"]
[null,null,null,null,"CP","Liste"]
["Classe 1","Classe","N. MORETON","Gymnastique sportive","CP3","N","2014-04-30","2014-05-07",{"$f":"IF(ISERROR(E5),1,\"\")","v":""},{"$f":"IF(COUNTA(D5:D10)<=2,\"\",COUNTA(D5:D10))","v":3}]
[null,"3è1",null,"Badminton","CP4","N","2014-07-23","2014-07-30",{"$f":"IF(ISERROR(E6),1,\"\")","v":""}]
[null,null,null,"Escalade","CP2","N","2014-10-29","2014-11-05",""]
[null,"nbre d'élèves :   ",null,null,"","",null,null,""]
[null,28,null,null,"","",null,null,""]
[null,null,null,null,"","",null,null,""]
["Classe 2","Classe","R.Renard","Gymnastique sportive","CP3","N","2014-04-03","2014-04-24","",{"$f":"IF(COUNTA(D11:D16)<=2,\"\",COUNTA(D11:D16))","v":3}]
[null,"3è2",null,"Badminton","CP4","N","2014-07-24","2014-07-31",""]
[null,null,null,"Escalade","CP2","N","2014-10-09","2014-10-30",""]
[null,"nbre d'élèves :   ",null,null,"","",null,null,""]
[null,29,null,null,"","",null,null,""]
[null,null,null,null,"","",null,null,""]
["Classe 3","Classe","R.Renard","Gymnastique sportive","CP3","N","2014-07-21","2014-07-28","",{"$f":"IF(COUNTA(D17:D22)<=2,\"\",COUNTA(D17:D22))","v":3}]
[null,"3è3",null,"Badminton","CP4","N","2014-04-28","2014-05-05",""]
[null,null,null,"Escalade","CP2","N","2014-10-06","2014-10-27",""]
[null,"nbre d'élèves :   ",null,null,"","",null,null,""]
[null,29,null,null,"","",null,null,""]
[null,null,null,null,"","",null,null,""]
["Classe 4","Classe","N. Moreton","Gymnastique sportive","CP3","N","2014-04-04","2014-04-25","",{"$f":"IF(COUNTA(D23:D28)<=2,\"\",COUNTA(D23:D28))","v":3}]
[null,"3è4",null,"Badminton","CP4","N","2014-07-25","2014-08-05",""]
[null,null,null,"Demi-fond","CP1","N","2014-10-31","2014-11-07",""]
[null,"nbre d'élèves :   ",null,null,"","",null,null,""]
[null,29,null,null,"","",null,null,""]
[null,null,null,null,"","",null,null,""]
["Classe 5","Classe","R.Renard","Gymnastique sportive","CP3","N","2014-04-30","2014-05-07","",{"$f":"IF(COUNTA(D29:D34)<=2,\"\",COUNTA(D29:D34))","v":3}]
[null,"3è5",null,"Badminton","CP4","N","2014-07-23","2014-07-30",""]
[null,null,null,"Escalade","CP2","N","2014-10-06","2014-10-27",""]
[null,"nbre d'élèves :   ",null,null,"","",null,null,""]
[null,29,null,null,"","",null,null,""]
[null,null,null,null,"","",null,null,""]
["Classe 6","Classe","N. Moreton","Gymnastique sportive","CP3","N","2014-04-30","2014-05-07","",{"$f":"IF(COUNTA(D35:D40)<=2,\"\",COUNTA(D35:D40))","v":3}]
[null,"3è6",null,"Badminton","CP4","N","2014-07-23","2014-07-30",""]
[null,null,null,"Escalade","CP2","N","2014-10-08","2014-10-29",""]
[null,"nbre d'élèves :   ",null,null,"","",null,null,""]
[null,22,null,null,"","",null,null,""]
[null,null,null,null,"","",null,null,""]
["Classe 7","Classe","prof7",null,"","",null,null,{"$f":"IF(ISERROR(E41),1,\"\")","v":""},{"$f":"IF(COUNTA(D41:D46)<=2,\"\",COUNTA(D41:D46))","v":""}]
[null,"3è7",null,null,"","",null,null,{"$f":"IF(ISERROR(E42),1,\"\")","v":""}]
[null,null,null,null,"","",null,null,""]
[null,"nbre d'élèves :   ",null,null,"","",null,null,""]
[null,null,null,null,"","",null,null,""]
[null,null,null,null,"","",null,null,""]
["Classe 8","Classe","prof8",null,"","",null,null,"",{"$f":"IF(COUNTA(D47:D52)<=2,\"\",COUNTA(D47:D52))","v":""}]
[null,"3è8",null,null,"","",null,null,""]
[null,null,null,null,"","",null,null,""]
[null,"nbre d'élèves :   ",null,null,"","",null,null,""]
[null,null,null,null,"","",null,null,""]
[null,null,null,null,"","",null,null,""]
["Classe 9","Classe","prof9",null,"","",null,null,"",{"$f":"IF(COUNTA(D53:D58)<=2,\"\",COUNTA(D53:D58))","v":""}]
[null,"3è9",null,null,"","",null,null,""]
[null,null,null,null,"","",null,null,""]
[null,"nbre d'élèves :   ",null,null,"","",null,null,""]
[null,null,null,null,"","",null,null,""]
[null,null,null,null,"","",null,null,""]
["Classe 10","Classe","prof10",null,"","",null,null,"",{"$f":"IF(COUNTA(D59:D64)<=2,\"\",COUNTA(D59:D64))","v":""}]
[null,"3è10",null,null,"","",null,null,""]
[null,null,null,null,"","",null,null,""]
[null,"nbre d'élèves :   ",null,null,"","",null,null,""]
[null,null,null,null,"","",null,null,""]
[null,null,null,null,"","",null,null,""]
["Classe 11","Classe","prof11",null,"","",null,null,"",{"$f":"IF(COUNTA(D65:D70)<=2,\"\",COUNTA(D65:D70))","v":""}]
[null,"3è11",null,null,"","",null,null,""]
[null,null,null,null,"","",null,null,""]
[null,"nbre d'élèves :   ",null,null,"","",null,null,""]
[null,null,null,null,"","",null,null,""]
[null,null,null,null,"","",null,null,""]
["Classe 12","Classe","prof12",null,"","",null,null,"",{"$f":"IF(COUNTA(D71:D76)<=2,\"\",COUNTA(D71:D76))","v":""}]
[null,"3è12",null,null,"","",null,null,""]
[null,null,null,null,"","",null,null,""]
[null,"nbre d'élèves :   ",null,null,"","",null,null,""]
[null,null,null,null,"","",null,null,""]
[null,null,null,null,"","",null,null,""]
[null,null,null,null,null,null,null,null,{"$f":"IF(COUNT(I5:I76)=0,\"\",\"Attention, une ou plusieurs APSA du protocole sont mal saisies!\")","v":""},{"$f":"AVERAGE(J5:J71)","v":3}]
[null,"Date de validation par le chef d'établissement :",null,null,null,null,null,null,null,{"$f":"COUNT(J5:J71)","v":6}]
[null,"Informations à transmettre à l'inspection :"]
[]
[null,null,null,null,null,null,null,null,""]
[]
[null,"Partie reservée à l'inspection :"]

{"sheet":"9830609V","index":39,"n_rows":83,"n_cols":10,"rows_kept":83,"cut":false,"hidden":false,"merged":[[0,3,0,5],[2,1,3,1],[2,2,3,2],[2,3,3,3],[2,4,2,5],[2,7,3,7],[4,0,9,0],[4,2,9,2],[10,0,15,0],[10,2,15,2],[16,0,21,0],[16,2,21,2],[2,6,3,6],[58,0,63,0],[58,2,63,2],[22,0,27,0],[22,2,27,2],[28,0,33,0],[28,2,33,2],[34,0,39,0],[34,2,39,2],[64,0,69,0],[64,2,69,2],[70,0,75,0],[70,2,75,2],[40,0,45,0],[40,2,45,2],[46,0,51,0],[46,2,51,2],[52,0,57,0],[52,2,57,2]]}
["R","DNB 2014","9830609V","CLG GELIMA - CANALA",null,null,"PROVINCE NORD","Académie de Nouvelle-Calédonie",{"$f":"IF(C1=\"\",\"\",VLOOKUP(C1,etab,4,FALSE))","v":"privé"}]
["GEBEPS_2014_IPR_PROTOCOLES_privé_9830609V.xls",null,null,null,"",null,null,null,{"$f":"Données!M11","v":"V3_29/10/13"}]
[null,"CLASSES            évaluées pour le DNB","NOM \nde l'enseignant responsable de la classe","Activités","Compétences\npropres",null,"dates des évaluations","dates des rattrapages",null,"nbre APSA\n/ classe"]
[null,null,null,null,"CP","Liste"]
["Classe 1","Classe","Eric PELLIER","Javelot","CP1","N","2014-10-01","08/1014",{"$f":"IF(ISERROR(E5),1,\"\")","v":""},{"$f":"IF(COUNTA(D5:D10)<=2,\"\",COUNTA(D5:D10))","v":3}]
[null,"3è1",null,"Foot","CP4","N","2014-11-26","2014-12-03",{"$f":"IF(ISERROR(E6),1,\"\")","v":""}]
[null,null,null,"Arts du cirque","CP3","N","2014-11-28","2014-11-05",""]
[null,"nbre d'élèves :   ",null,null,"","",null,null,""]
[null,18,null,null,"","",null,null,""]
[null,null,null,null,"","",null,null,""]
["Classe 2","Classe","prof2",null,"","",null,null,"",{"$f":"IF(COUNTA(D11:D16)<=2,\"\",COUNTA(D11:D16))","v":""}]
[null,"3è2",null,null,"","",null,null,""]
[null,null,null,null,"","",null,null,""]
[null,"nbre d'élèves :   ",null,null,"","",null,null,""]
[null,null,null,null,"","",null,null,""]
[null,null,null,null,"","",null,null,""]
["Classe 3","Classe","prof3",null,"","",null,null,"",{"$f":"IF(COUNTA(D17:D22)<=2,\"\",COUNTA(D17:D22))","v":""}]
[null,"3è3",null,null,"","",null,null,""]
[null,null,null,null,"","",null,null,""]
[null,"nbre d'élèves :   ",null,null,"","",null,null,""]
[null,null,null,null,"","",null,null,""]
[null,null,null,null,"","",null,null,""]
["Classe 4","Classe","prof4",null,"","",null,null,"",{"$f":"IF(COUNTA(D23:D28)<=2,\"\",COUNTA(D23:D28))","v":""}]
[null,"3è4",null,null,"","",null,null,""]
[null,null,null,null,"","",null,null,""]
[null,"nbre d'élèves :   ",null,null,"","",null,null,""]
[null,null,null,null,"","",null,null,""]
[null,null,null,null,"","",null,null,""]
["Classe 5","Classe","prof5",null,"","",null,null,"",{"$f":"IF(COUNTA(D29:D34)<=2,\"\",COUNTA(D29:D34))","v":""}]
[null,"3è5",null,null,"","",null,null,""]
[null,null,null,null,"","",null,null,""]
[null,"nbre d'élèves :   ",null,null,"","",null,null,""]
[null,null,null,null,"","",null,null,""]
[null,null,null,null,"","",null,null,""]
["Classe 6","Classe","prof6",null,"","",null,null,"",{"$f":"IF(COUNTA(D35:D40)<=2,\"\",COUNTA(D35:D40))","v":""}]
[null,"3è6",null,null,"","",null,null,""]
[null,null,null,null,"","",null,null,""]
[null,"nbre d'élèves :   ",null,null,"","",null,null,""]
[null,null,null,null,"","",null,null,""]
[null,null,null,null,"","",null,null,""]
["Classe 7","Classe","prof7",null,"","",null,null,{"$f":"IF(ISERROR(E41),1,\"\")","v":""},{"$f":"IF(COUNTA(D41:D46)<=2,\"\",COUNTA(D41:D46))","v":""}]
[null,"3è7",null,null,"","",null,null,{"$f":"IF(ISERROR(E42),1,\"\")","v":""}]
[null,null,null,null,"","",null,null,""]
[null,"nbre d'élèves :   ",null,null,"","",null,null,""]
[null,null,null,null,"","",null,null,""]
[null,null,null,null,"","",null,null,""]
["Classe 8","Classe","prof8",null,"","",null,null,"",{"$f":"IF(COUNTA(D47:D52)<=2,\"\",COUNTA(D47:D52))","v":""}]
[null,"3è8",null,null,"","",null,null,""]
[null,null,null,null,"","",null,null,""]
[null,"nbre d'élèves :   ",null,null,"","",null,null,""]
[null,null,null,null,"","",null,null,""]
[null,null,null,null,"","",null,null,""]
["Classe 9","Classe","prof9",null,"","",null,null,"",{"$f":"IF(COUNTA(D53:D58)<=2,\"\",COUNTA(D53:D58))","v":""}]
[null,"3è9",null,null,"","",null,null,""]
[null,null,null,null,"","",null,null,""]
[null,"nbre d'élèves :   ",null,null,"","",null,null,""]
[null,null,null,null,"","",null,null,""]
[null,null,null,null,"","",null,null,""]
["Classe 10","Classe","prof10",null,"","",null,null,"",{"$f":"IF(COUNTA(D59:D64)<=2,\"\",COUNTA(D59:D64))","v":""}]
[null,"3è10",null,null,"","",null,null,""]
[null,null,null,null,"","",null,null,""]
[null,"nbre d'élèves :   ",null,null,"","",null,null,""]
[null,null,null,null,"","",null,null,""]
[null,null,null,null,"","",null,null,""]
["Classe 11","Classe","prof11",null,"","",null,null,"",{"$f":"IF(COUNTA(D65:D70)<=2,\"\",COUNTA(D65:D70))","v":""}]
[null,"3è11",null,null,"","",null,null,""]
[null,null,null,null,"","",null,null,""]
[null,"nbre d'élèves :   ",null,null,"","",null,null,""]
[null,null,null,null,"","",null,null,""]
[null,null,null,null,"","",null,null,""]
["Classe 12","Classe","prof12",null,"","",null,null,"",{"$f":"IF(COUNTA(D71:D76)<=2,\"\",COUNTA(D71:D76))","v":""}]
[null,"3è12",null,null,"","",null,null,""]
[null,null,null,null,"","",null,null,""]
[null,"nbre d'élèves :   ",null,null,"","",null,null,""]
[null,null,null,null,"","",null,null,""]
[null,null,null,null,"","",null,null,""]
[null,null,null,null,null,null,null,null,{"$f":"IF(COUNT(I5:I76)=0,\"\",\"Attention, une ou plusieurs APSA du protocole sont mal saisies!\")","v":""},{"$f":"AVERAGE(J5:J71)","v":3}]
[null,"Date de validation par le chef d'établissement :",null,null,"2014-06-05",null,null,null,null,{"$f":"COUNT(J5:J71)","v":1}]
[null,"Informations à transmettre à l'inspection :"]
[]
[null,null,null,null,null,null,null,null,""]
[]
[null,"Partie reservée à l'inspection :"]

{"sheet":"9830518W","index":40,"n_rows":83,"n_cols":10,"rows_kept":83,"cut":false,"hidden":false,"merged":[[0,3,0,5],[2,1,3,1],[2,2,3,2],[2,3,3,3],[2,4,2,5],[2,7,3,7],[4,0,9,0],[4,2,9,2],[10,0,15,0],[10,2,15,2],[16,0,21,0],[16,2,21,2],[2,6,3,6],[58,0,63,0],[58,2,63,2],[22,0,27,0],[22,2,27,2],[28,0,33,0],[28,2,33,2],[34,0,39,0],[34,2,39,2],[64,0,69,0],[64,2,69,2],[70,0,75,0],[70,2,75,2],[40,0,45,0],[40,2,45,2],[46,0,51,0],[46,2,51,2],[52,0,57,0],[52,2,57,2]]}
["R","DNB 2014","9830518W","CLG BOUAVA KALEBA - POUM",null,null,"PROVINCE NORD","Académie de Nouvelle-Calédonie",{"$f":"IF(C1=\"\",\"\",VLOOKUP(C1,etab,4,FALSE))","v":"privé"}]
["GEBEPS_2014_IPR_PROTOCOLES_privé_9830518W.xls",null,null,null,"",null,null,null,{"$f":"Données!M11","v":"V3_29/10/13"}]
[null,"CLASSES            évaluées pour le DNB","NOM \nde l'enseignant responsable de la classe","Activités","Compétences\npropres",null,"dates des évaluations","dates des rattrapages",null,"nbre APSA\n/ classe"]
[null,null,null,null,"CP","Liste"]
["Classe 1","Classe","MATHIEU","Demi-fond","CP1","N","2014-07-28","2014-08-01",{"$f":"IF(ISERROR(E5),1,\"\")","v":""},{"$f":"IF(COUNTA(D5:D10)<=2,\"\",COUNTA(D5:D10))","v":3}]
[null,"3èG",null,"Volley","CP4","N","2014-07-18","2014-07-25",{"$f":"IF(ISERROR(E6),1,\"\")","v":""}]
[null,null,null,"Gymnastique sportive","CP3","N","2014-10-10","2014-10-31",""]
[null,"nbre d'élèves :   ",null,null,"","",null,null,""]
[null,14,null,null,"","",null,null,""]
[null,null,null,null,"","",null,null,""]
["Classe 2","Classe","prof2",null,"","",null,null,"",{"$f":"IF(COUNTA(D11:D16)<=2,\"\",COUNTA(D11:D16))","v":""}]
[null,"3è2",null,null,"","",null,null,""]
[null,null,null,null,"","",null,null,""]
[null,"nbre d'élèves :   ",null,null,"","",null,null,""]
[null,null,null,null,"","",null,null,""]
[null,null,null,null,"","",null,null,""]
["Classe 3","Classe","prof3",null,"","",null,null,"",{"$f":"IF(COUNTA(D17:D22)<=2,\"\",COUNTA(D17:D22))","v":""}]
[null,"3è3",null,null,"","",null,null,""]
[null,null,null,null,"","",null,null,""]
[null,"nbre d'élèves :   ",null,null,"","",null,null,""]
[null,null,null,null,"","",null,null,""]
[null,null,null,null,"","",null,null,""]
["Classe 4","Classe","prof4",null,"","",null,null,"",{"$f":"IF(COUNTA(D23:D28)<=2,\"\",COUNTA(D23:D28))","v":""}]
[null,"3è4",null,null,"","",null,null,""]
[null,null,null,null,"","",null,null,""]
[null,"nbre d'élèves :   ",null,null,"","",null,null,""]
[null,null,null,null,"","",null,null,""]
[null,null,null,null,"","",null,null,""]
["Classe 5","Classe","prof5",null,"","",null,null,"",{"$f":"IF(COUNTA(D29:D34)<=2,\"\",COUNTA(D29:D34))","v":""}]
[null,"3è5",null,null,"","",null,null,""]
[null,null,null,null,"","",null,null,""]
[null,"nbre d'élèves :   ",null,null,"","",null,null,""]
[null,null,null,null,"","",null,null,""]
[null,null,null,null,"","",null,null,""]
["Classe 6","Classe","prof6",null,"","",null,null,"",{"$f":"IF(COUNTA(D35:D40)<=2,\"\",COUNTA(D35:D40))","v":""}]
[null,"3è6",null,null,"","",null,null,""]
[null,null,null,null,"","",null,null,""]
[null,"nbre d'élèves :   ",null,null,"","",null,null,""]
[null,null,null,null,"","",null,null,""]
[null,null,null,null,"","",null,null,""]
["Classe 7","Classe","prof7",null,"","",null,null,{"$f":"IF(ISERROR(E41),1,\"\")","v":""},{"$f":"IF(COUNTA(D41:D46)<=2,\"\",COUNTA(D41:D46))","v":""}]
[null,"3è7",null,null,"","",null,null,{"$f":"IF(ISERROR(E42),1,\"\")","v":""}]
[null,null,null,null,"","",null,null,""]
[null,"nbre d'élèves :   ",null,null,"","",null,null,""]
[null,null,null,null,"","",null,null,""]
[null,null,null,null,"","",null,null,""]
["Classe 8","Classe","prof8",null,"","",null,null,"",{"$f":"IF(COUNTA(D47:D52)<=2,\"\",COUNTA(D47:D52))","v":""}]
[null,"3è8",null,null,"","",null,null,""]
[null,null,null,null,"","",null,null,""]
[null,"nbre d'élèves :   ",null,null,"","",null,null,""]
[null,null,null,null,"","",null,null,""]
[null,null,null,null,"","",null,null,""]
["Classe 9","Classe","prof9",null,"","",null,null,"",{"$f":"IF(COUNTA(D53:D58)<=2,\"\",COUNTA(D53:D58))","v":""}]
[null,"3è9",null,null,"","",null,null,""]
[null,null,null,null,"","",null,null,""]
[null,"nbre d'élèves :   ",null,null,"","",null,null,""]
[null,null,null,null,"","",null,null,""]
[null,null,null,null,"","",null,null,""]
["Classe 10","Classe","prof10",null,"","",null,null,"",{"$f":"IF(COUNTA(D59:D64)<=2,\"\",COUNTA(D59:D64))","v":""}]
[null,"3è10",null,null,"","",null,null,""]
[null,null,null,null,"","",null,null,""]
[null,"nbre d'élèves :   ",null,null,"","",null,null,""]
[null,null,null,null,"","",null,null,""]
[null,null,null,null,"","",null,null,""]
["Classe 11","Classe","prof11",null,"","",null,null,"",{"$f":"IF(COUNTA(D65:D70)<=2,\"\",COUNTA(D65:D70))","v":""}]
[null,"3è11",null,null,"","",null,null,""]
[null,null,null,null,"","",null,null,""]
[null,"nbre d'élèves :   ",null,null,"","",null,null,""]
[null,null,null,null,"","",null,null,""]
[null,null,null,null,"","",null,null,""]
["Classe 12","Classe","prof12",null,"","",null,null,"",{"$f":"IF(COUNTA(D71:D76)<=2,\"\",COUNTA(D71:D76))","v":""}]
[null,"3è12",null,null,"","",null,null,""]
[null,null,null,null,"","",null,null,""]
[null,"nbre d'élèves :   ",null,null,"","",null,null,""]
[null,null,null,null,"","",null,null,""]
[null,null,null,null,"","",null,null,""]
[null,null,null,null,null,null,null,null,{"$f":"IF(COUNT(I5:I76)=0,\"\",\"Attention, une ou plusieurs APSA du protocole sont mal saisies!\")","v":""},{"$f":"AVERAGE(J5:J71)","v":3}]
[null,"Date de validation par le chef d'établissement :",null,null,null,null,"2014-06-05",null,null,{"$f":"COUNT(J5:J71)","v":1}]
[null,"Informations à transmettre à l'inspection :"]
[]
[null,null,null,null,null,null,null,null,""]
[]
[null,"Partie reservée à l'inspection :"]

{"sheet":"9830447U","index":41,"n_rows":83,"n_cols":10,"rows_kept":83,"cut":false,"hidden":false,"merged":[[0,3,0,5],[2,1,3,1],[2,2,3,2],[2,3,3,3],[2,4,2,5],[2,7,3,7],[4,0,9,0],[4,2,9,2],[10,0,15,0],[10,2,15,2],[16,0,21,0],[16,2,21,2],[2,6,3,6],[58,0,63,0],[58,2,63,2],[22,0,27,0],[22,2,27,2],[28,0,33,0],[28,2,33,2],[34,0,39,0],[34,2,39,2],[64,0,69,0],[64,2,69,2],[70,0,75,0],[70,2,75,2],[40,0,45,0],[40,2,45,2],[46,0,51,0],[46,2,51,2],[52,0,57,0],[52,2,57,2]]}
["R","DNB 2014","9830447U","CLG EBEN EZA - OUVEA",null,null,"PROVINCE DES ILES","Académie de Nouvelle-Calédonie",{"$f":"IF(C1=\"\",\"\",VLOOKUP(C1,etab,4,FALSE))","v":"privé"}]
["GEBEPS_2014_IPR_PROTOCOLES_privé_9830447U.xls",null,null,null,"",null,null,null,{"$f":"Données!M11","v":"V3_29/10/13"}]
[null,"CLASSES            évaluées pour le DNB","NOM \nde l'enseignant responsable de la classe","Activités","Compétences\npropres",null,"dates des évaluations","dates des rattrapages",null,"nbre APSA\n/ classe"]
[null,null,null,null,"CP","Liste"]
["Classe 1","Classe","WEJIEME Philippe","Relais-vitesse","CP1","N","2014-10-07","2014-10-14",{"$f":"IF(ISERROR(E5),1,\"\")","v":""},{"$f":"IF(COUNTA(D5:D10)<=2,\"\",COUNTA(D5:D10))","v":3}]
[null,"3èG",null,"Canoë-Kayak","CP2","N","2014-06-03","2014-06-24",{"$f":"IF(ISERROR(E6),1,\"\")","v":""}]
[null,null,null,"Volley","CP4","N","2014-04-29","2014-05-06",""]
[null,"nbre d'élèves :   ",null,null,"","",null,null,""]
[null,21,null,null,"","",null,null,""]
[null,null,null,null,"","",null,null,""]
["Classe 2","Classe","prof2",null,"","",null,null,"",{"$f":"IF(COUNTA(D11:D16)<=2,\"\",COUNTA(D11:D16))","v":""}]
[null,"3è2",null,null,"","",null,null,""]
[null,null,null,null,"","",null,null,""]
[null,"nbre d'élèves :   ",null,null,"","",null,null,""]
[null,null,null,null,"","",null,null,""]
[null,null,null,null,"","",null,null,""]
["Classe 3","Classe","prof3",null,"","",null,null,"",{"$f":"IF(COUNTA(D17:D22)<=2,\"\",COUNTA(D17:D22))","v":""}]
[null,"3è3",null,null,"","",null,null,""]
[null,null,null,null,"","",null,null,""]
[null,"nbre d'élèves :   ",null,null,"","",null,null,""]
[null,null,null,null,"","",null,null,""]
[null,null,null,null,"","",null,null,""]
["Classe 4","Classe","prof4",null,"","",null,null,"",{"$f":"IF(COUNTA(D23:D28)<=2,\"\",COUNTA(D23:D28))","v":""}]
[null,"3è4",null,null,"","",null,null,""]
[null,null,null,null,"","",null,null,""]
[null,"nbre d'élèves :   ",null,null,"","",null,null,""]
[null,null,null,null,"","",null,null,""]
[null,null,null,null,"","",null,null,""]
["Classe 5","Classe","prof5",null,"","",null,null,"",{"$f":"IF(COUNTA(D29:D34)<=2,\"\",COUNTA(D29:D34))","v":""}]
[null,"3è5",null,null,"","",null,null,""]
[null,null,null,null,"","",null,null,""]
[null,"nbre d'élèves :   ",null,null,"","",null,null,""]
[null,null,null,null,"","",null,null,""]
[null,null,null,null,"","",null,null,""]
["Classe 6","Classe","prof6",null,"","",null,null,"",{"$f":"IF(COUNTA(D35:D40)<=2,\"\",COUNTA(D35:D40))","v":""}]
[null,"3è6",null,null,"","",null,null,""]
[null,null,null,null,"","",null,null,""]
[null,"nbre d'élèves :   ",null,null,"","",null,null,""]
[null,null,null,null,"","",null,null,""]
[null,null,null,null,"","",null,null,""]
["Classe 7","Classe","prof7",null,"","",null,null,{"$f":"IF(ISERROR(E41),1,\"\")","v":""},{"$f":"IF(COUNTA(D41:D46)<=2,\"\",COUNTA(D41:D46))","v":""}]
[null,"3è7",null,null,"","",null,null,{"$f":"IF(ISERROR(E42),1,\"\")","v":""}]
[null,null,null,null,"","",null,null,""]
[null,"nbre d'élèves :   ",null,null,"","",null,null,""]
[null,null,null,null,"","",null,null,""]
[null,null,null,null,"","",null,null,""]
["Classe 8","Classe","prof8",null,"","",null,null,"",{"$f":"IF(COUNTA(D47:D52)<=2,\"\",COUNTA(D47:D52))","v":""}]
[null,"3è8",null,null,"","",null,null,""]
[null,null,null,null,"","",null,null,""]
[null,"nbre d'élèves :   ",null,null,"","",null,null,""]
[null,null,null,null,"","",null,null,""]
[null,null,null,null,"","",null,null,""]
["Classe 9","Classe","prof9",null,"","",null,null,"",{"$f":"IF(COUNTA(D53:D58)<=2,\"\",COUNTA(D53:D58))","v":""}]
[null,"3è9",null,null,"","",null,null,""]
[null,null,null,null,"","",null,null,""]
[null,"nbre d'élèves :   ",null,null,"","",null,null,""]
[null,null,null,null,"","",null,null,""]
[null,null,null,null,"","",null,null,""]
["Classe 10","Classe","prof10",null,"","",null,null,"",{"$f":"IF(COUNTA(D59:D64)<=2,\"\",COUNTA(D59:D64))","v":""}]
[null,"3è10",null,null,"","",null,null,""]
[null,null,null,null,"","",null,null,""]
[null,"nbre d'élèves :   ",null,null,"","",null,null,""]
[null,null,null,null,"","",null,null,""]
[null,null,null,null,"","",null,null,""]
["Classe 11","Classe","prof11",null,"","",null,null,"",{"$f":"IF(COUNTA(D65:D70)<=2,\"\",COUNTA(D65:D70))","v":""}]
[null,"3è11",null,null,"","",null,null,""]
[null,null,null,null,"","",null,null,""]
[null,"nbre d'élèves :   ",null,null,"","",null,null,""]
[null,null,null,null,"","",null,null,""]
[null,null,null,null,"","",null,null,""]
["Classe 12","Classe","prof12",null,"","",null,null,"",{"$f":"IF(COUNTA(D71:D76)<=2,\"\",COUNTA(D71:D76))","v":""}]
[null,"3è12",null,null,"","",null,null,""]
[null,null,null,null,"","",null,null,""]
[null,"nbre d'élèves :   ",null,null,"","",null,null,""]
[null,null,null,null,"","",null,null,""]
[null,null,null,null,"","",null,null,""]
[null,null,null,null,null,null,null,null,{"$f":"IF(COUNT(I5:I76)=0,\"\",\"Attention, une ou plusieurs APSA du protocole sont mal saisies!\")","v":""},{"$f":"AVERAGE(J5:J71)","v":3}]
[null,"Date de validation par le chef d'établissement :",null,null,null,null,null,null,null,{"$f":"COUNT(J5:J71)","v":1}]
[null,"Informations à transmettre à l'inspection :"]
[]
[null,null,null,null,null,null,null,null,""]
[]
[null,"Partie reservée à l'inspection :"]

{"sheet":"9830432C","index":42,"n_rows":83,"n_cols":10,"rows_kept":83,"cut":false,"hidden":false,"merged":[[0,3,0,5],[2,1,3,1],[2,2,3,2],[2,3,3,3],[2,4,2,5],[2,7,3,7],[4,0,9,0],[4,2,9,2],[10,0,15,0],[10,2,15,2],[16,0,21,0],[16,2,21,2],[2,6,3,6],[58,0,63,0],[58,2,63,2],[22,0,27,0],[22,2,27,2],[28,0,33,0],[28,2,33,2],[34,0,39,0],[34,2,39,2],[64,0,69,0],[64,2,69,2],[70,0,75,0],[70,2,75,2],[40,0,45,0],[40,2,45,2],[46,0,51,0],[46,2,51,2],[52,0,57,0],[52,2,57,2]]}
["R","DNB 2014","9830432C","CLG TIETA - VOH",null,null,"PROVINCE NORD","Académie de Nouvelle-Calédonie",{"$f":"IF(C1=\"\",\"\",VLOOKUP(C1,etab,4,FALSE))","v":"privé"}]
["GEBEPS_2014_IPR_PROTOCOLES_privé_9830432C.xls",null,null,null,"",null,null,null,{"$f":"Données!M11","v":"V3_29/10/13"}]
[null,"CLASSES            évaluées pour le DNB","NOM \nde l'enseignant responsable de la classe","Activités","Compétences\npropres",null,"dates des évaluations","dates des rattrapages",null,"nbre APSA\n/ classe"]
[null,null,null,null,"CP","Liste"]
["Classe 1","Classe","BABIN Olivier","Demi-fond","CP1","N","2014-07-04","2014-07-11",{"$f":"IF(ISERROR(E5),1,\"\")","v":""},{"$f":"IF(COUNTA(D5:D10)<=2,\"\",COUNTA(D5:D10))","v":3}]
[null,"3èA",null,"Basket","CP4","N","2014-08-05","2014-08-12",{"$f":"IF(ISERROR(E6),1,\"\")","v":""}]
[null,null,null,"Gymnastique sportive","CP3","N","2014-11-04","2014-11-13",""]
[null,"nbre d'élèves :   ",null,null,"","",null,null,""]
[null,20,null,null,"","",null,null,""]
[null,null,null,null,"","",null,null,""]
["Classe 2","Classe","BOULAGNON Pierre Jean","Demi-fond","CP1","N","2014-07-04","2014-07-11","",{"$f":"IF(COUNTA(D11:D16)<=2,\"\",COUNTA(D11:D16))","v":3}]
[null,"3èB",null,"Basket","CP4","N","2014-08-05","2014-08-12",""]
[null,null,null,"Gymnastique sportive","CP3","N","2014-11-04","2014-11-13",""]
[null,"nbre d'élèves :   ",null,null,"","",null,null,""]
[null,21,null,null,"","",null,null,""]
[null,null,null,null,"","",null,null,""]
["Classe 3","Classe","BOULAGNON Pierre Jean","Demi-fond","CP1","N","2014-07-04","2014-07-11","",{"$f":"IF(COUNTA(D17:D22)<=2,\"\",COUNTA(D17:D22))","v":3}]
[null,"3èC",null,"Basket","CP4","N","2014-08-05","2014-08-12",""]
[null,null,null,"Gymnastique sportive","CP3","N","2014-11-04","2014-11-13",""]
[null,"nbre d'élèves :   ",null,null,"","",null,null,""]
[null,14,null,null,"","",null,null,""]
[null,null,null,null,"","",null,null,""]
["Classe 4","Classe","prof4",null,"","",null,null,"",{"$f":"IF(COUNTA(D23:D28)<=2,\"\",COUNTA(D23:D28))","v":""}]
[null,"3è4",null,null,"","",null,null,""]
[null,null,null,null,"","",null,null,""]
[null,"nbre d'élèves :   ",null,null,"","",null,null,""]
[null,null,null,null,"","",null,null,""]
[null,null,null,null,"","",null,null,""]
["Classe 5","Classe","prof5",null,"","",null,null,"",{"$f":"IF(COUNTA(D29:D34)<=2,\"\",COUNTA(D29:D34))","v":""}]
[null,"3è5",null,null,"","",null,null,""]
[null,null,null,null,"","",null,null,""]
[null,"nbre d'élèves :   ",null,null,"","",null,null,""]
[null,null,null,null,"","",null,null,""]
[null,null,null,null,"","",null,null,""]
["Classe 6","Classe","prof6",null,"","",null,null,"",{"$f":"IF(COUNTA(D35:D40)<=2,\"\",COUNTA(D35:D40))","v":""}]
[null,"3è6",null,null,"","",null,null,""]
[null,null,null,null,"","",null,null,""]
[null,"nbre d'élèves :   ",null,null,"","",null,null,""]
[null,null,null,null,"","",null,null,""]
[null,null,null,null,"","",null,null,""]
["Classe 7","Classe","prof7",null,"","",null,null,{"$f":"IF(ISERROR(E41),1,\"\")","v":""},{"$f":"IF(COUNTA(D41:D46)<=2,\"\",COUNTA(D41:D46))","v":""}]
[null,"3è7",null,null,"","",null,null,{"$f":"IF(ISERROR(E42),1,\"\")","v":""}]
[null,null,null,null,"","",null,null,""]
[null,"nbre d'élèves :   ",null,null,"","",null,null,""]
[null,null,null,null,"","",null,null,""]
[null,null,null,null,"","",null,null,""]
["Classe 8","Classe","prof8",null,"","",null,null,"",{"$f":"IF(COUNTA(D47:D52)<=2,\"\",COUNTA(D47:D52))","v":""}]
[null,"3è8",null,null,"","",null,null,""]
[null,null,null,null,"","",null,null,""]
[null,"nbre d'élèves :   ",null,null,"","",null,null,""]
[null,null,null,null,"","",null,null,""]
[null,null,null,null,"","",null,null,""]
["Classe 9","Classe","prof9",null,"","",null,null,"",{"$f":"IF(COUNTA(D53:D58)<=2,\"\",COUNTA(D53:D58))","v":""}]
[null,"3è9",null,null,"","",null,null,""]
[null,null,null,null,"","",null,null,""]
[null,"nbre d'élèves :   ",null,null,"","",null,null,""]
[null,null,null,null,"","",null,null,""]
[null,null,null,null,"","",null,null,""]
["Classe 10","Classe","prof10",null,"","",null,null,"",{"$f":"IF(COUNTA(D59:D64)<=2,\"\",COUNTA(D59:D64))","v":""}]
[null,"3è10",null,null,"","",null,null,""]
[null,null,null,null,"","",null,null,""]
[null,"nbre d'élèves :   ",null,null,"","",null,null,""]
[null,null,null,null,"","",null,null,""]
[null,null,null,null,"","",null,null,""]
["Classe 11","Classe","prof11",null,"","",null,null,"",{"$f":"IF(COUNTA(D65:D70)<=2,\"\",COUNTA(D65:D70))","v":""}]
[null,"3è11",null,null,"","",null,null,""]
[null,null,null,null,"","",null,null,""]
[null,"nbre d'élèves :   ",null,null,"","",null,null,""]
[null,null,null,null,"","",null,null,""]
[null,null,null,null,"","",null,null,""]
["Classe 12","Classe","prof12",null,"","",null,null,"",{"$f":"IF(COUNTA(D71:D76)<=2,\"\",COUNTA(D71:D76))","v":""}]
[null,"3è12",null,null,"","",null,null,""]
[null,null,null,null,"","",null,null,""]
[null,"nbre d'élèves :   ",null,null,"","",null,null,""]
[null,null,null,null,"","",null,null,""]
[null,null,null,null,"","",null,null,""]
[null,null,null,null,null,null,null,null,{"$f":"IF(COUNT(I5:I76)=0,\"\",\"Attention, une ou plusieurs APSA du protocole sont mal saisies!\")","v":""},{"$f":"AVERAGE(J5:J71)","v":3}]
[null,"Date de validation par le chef d'établissement :",null,null,null,null,null,null,null,{"$f":"COUNT(J5:J71)","v":3}]
[null,"Informations à transmettre à l'inspection :"]
[]
[null,null,null,null,null,null,null,null,""]
[]
[null,"Partie reservée à l'inspection :"]

{"sheet":"9830420P","index":43,"n_rows":83,"n_cols":10,"rows_kept":83,"cut":false,"hidden":false,"merged":[[0,3,0,5],[2,1,3,1],[2,2,3,2],[2,3,3,3],[2,4,2,5],[2,7,3,7],[4,0,9,0],[4,2,9,2],[10,0,15,0],[10,2,15,2],[16,0,21,0],[16,2,21,2],[2,6,3,6],[58,0,63,0],[58,2,63,2],[22,0,27,0],[22,2,27,2],[28,0,33,0],[28,2,33,2],[34,0,39,0],[34,2,39,2],[64,0,69,0],[64,2,69,2],[70,0,75,0],[70,2,75,2],[40,0,45,0],[40,2,45,2],[46,0,51,0],[46,2,51,2],[52,0,57,0],[52,2,57,2]]}
["R","DNB 2014","9830420P","CLG HNAIZIANU - LIFOU",null,null,"PROVINCE DES ILES","Académie de Nouvelle-Calédonie",{"$f":"IF(C1=\"\",\"\",VLOOKUP(C1,etab,4,FALSE))","v":"privé"}]
["GEBEPS_2014_IPR_PROTOCOLES_privé_9830420P.xls",null,null,null,"",null,null,null,{"$f":"Données!M11","v":"V3_29/10/13"}]
[null,"CLASSES            évaluées pour le DNB","NOM \nde l'enseignant responsable de la classe","Activités","Compétences\npropres",null,"dates des évaluations","dates des rattrapages",null,"nbre APSA\n/ classe"]
[null,null,null,null,"CP","Liste"]
["Classe 1","Classe","Salinas","Volley","CP4","N","2014-04-04","2014-04-25",{"$f":"IF(ISERROR(E5),1,\"\")","v":""},{"$f":"IF(COUNTA(D5:D10)<=2,\"\",COUNTA(D5:D10))","v":3}]
[null,"3èA",null,"Danse","CP3","N","2014-08-08","2014-08-29",{"$f":"IF(ISERROR(E6),1,\"\")","v":""}]
[null,null,null,"Relais-vitesse","CP1","N","2014-10-07","2014-10-31",""]
[null,"nbre d'élèves :   ",null,null,"","",null,null,""]
[null,16,null,null,"","",null,null,""]
[null,null,null,null,"","",null,null,""]
["Classe 2","Classe","Salinas","Volley","CP4","N","2014-05-05","2014-05-12","",{"$f":"IF(COUNTA(D11:D16)<=2,\"\",COUNTA(D11:D16))","v":3}]
[null,"3èB",null,"Danse","CP3","N","2014-08-05","2014-08-25",""]
[null,null,null,"Relais-vitesse","CP1","N","2014-10-07","2014-10-27",""]
[null,"nbre d'élèves :   ",null,null,"","",null,null,""]
[null,16,null,null,"","",null,null,""]
[null,null,null,null,"","",null,null,""]
["Classe 3","Classe","prof3",null,"","",null,null,"",{"$f":"IF(COUNTA(D17:D22)<=2,\"\",COUNTA(D17:D22))","v":""}]
[null,"3è3",null,null,"","",null,null,""]
[null,null,null,null,"","",null,null,""]
[null,"nbre d'élèves :   ",null,null,"","",null,null,""]
[null,null,null,null,"","",null,null,""]
[null,null,null,null,"","",null,null,""]
["Classe 4","Classe","prof4",null,"","",null,null,"",{"$f":"IF(COUNTA(D23:D28)<=2,\"\",COUNTA(D23:D28))","v":""}]
[null,"3è4",null,null,"","",null,null,""]
[null,null,null,null,"","",null,null,""]
[null,"nbre d'élèves :   ",null,null,"","",null,null,""]
[null,null,null,null,"","",null,null,""]
[null,null,null,null,"","",null,null,""]
["Classe 5","Classe","prof5",null,"","",null,null,"",{"$f":"IF(COUNTA(D29:D34)<=2,\"\",COUNTA(D29:D34))","v":""}]
[null,"3è5",null,null,"","",null,null,""]
[null,null,null,null,"","",null,null,""]
[null,"nbre d'élèves :   ",null,null,"","",null,null,""]
[null,null,null,null,"","",null,null,""]
[null,null,null,null,"","",null,null,""]
["Classe 6","Classe","prof6",null,"","",null,null,"",{"$f":"IF(COUNTA(D35:D40)<=2,\"\",COUNTA(D35:D40))","v":""}]
[null,"3è6",null,null,"","",null,null,""]
[null,null,null,null,"","",null,null,""]
[null,"nbre d'élèves :   ",null,null,"","",null,null,""]
[null,null,null,null,"","",null,null,""]
[null,null,null,null,"","",null,null,""]
["Classe 7","Classe","prof7",null,"","",null,null,{"$f":"IF(ISERROR(E41),1,\"\")","v":""},{"$f":"IF(COUNTA(D41:D46)<=2,\"\",COUNTA(D41:D46))","v":""}]
[null,"3è7",null,null,"","",null,null,{"$f":"IF(ISERROR(E42),1,\"\")","v":""}]
[null,null,null,null,"","",null,null,""]
[null,"nbre d'élèves :   ",null,null,"","",null,null,""]
[null,null,null,null,"","",null,null,""]
[null,null,null,null,"","",null,null,""]
["Classe 8","Classe","prof8",null,"","",null,null,"",{"$f":"IF(COUNTA(D47:D52)<=2,\"\",COUNTA(D47:D52))","v":""}]
[null,"3è8",null,null,"","",null,null,""]
[null,null,null,null,"","",null,null,""]
[null,"nbre d'élèves :   ",null,null,"","",null,null,""]
[null,null,null,null,"","",null,null,""]
[null,null,null,null,"","",null,null,""]
["Classe 9","Classe","prof9",null,"","",null,null,"",{"$f":"IF(COUNTA(D53:D58)<=2,\"\",COUNTA(D53:D58))","v":""}]
[null,"3è9",null,null,"","",null,null,""]
[null,null,null,null,"","",null,null,""]
[null,"nbre d'élèves :   ",null,null,"","",null,null,""]
[null,null,null,null,"","",null,null,""]
[null,null,null,null,"","",null,null,""]
["Classe 10","Classe","prof10",null,"","",null,null,"",{"$f":"IF(COUNTA(D59:D64)<=2,\"\",COUNTA(D59:D64))","v":""}]
[null,"3è10",null,null,"","",null,null,""]
[null,null,null,null,"","",null,null,""]
[null,"nbre d'élèves :   ",null,null,"","",null,null,""]
[null,null,null,null,"","",null,null,""]
[null,null,null,null,"","",null,null,""]
["Classe 11","Classe","prof11",null,"","",null,null,"",{"$f":"IF(COUNTA(D65:D70)<=2,\"\",COUNTA(D65:D70))","v":""}]
[null,"3è11",null,null,"","",null,null,""]
[null,null,null,null,"","",null,null,""]
[null,"nbre d'élèves :   ",null,null,"","",null,null,""]
[null,null,null,null,"","",null,null,""]
[null,null,null,null,"","",null,null,""]
["Classe 12","Classe","prof12",null,"","",null,null,"",{"$f":"IF(COUNTA(D71:D76)<=2,\"\",COUNTA(D71:D76))","v":""}]
[null,"3è12",null,null,"","",null,null,""]
[null,null,null,null,"","",null,null,""]
[null,"nbre d'élèves :   ",null,null,"","",null,null,""]
[null,null,null,null,"","",null,null,""]
[null,null,null,null,"","",null,null,""]
[null,null,null,null,null,null,null,null,{"$f":"IF(COUNT(I5:I76)=0,\"\",\"Attention, une ou plusieurs APSA du protocole sont mal saisies!\")","v":""},{"$f":"AVERAGE(J5:J71)","v":3}]
[null,"Date de validation par le chef d'établissement :",null,null,null,null,null,null,null,{"$f":"COUNT(J5:J71)","v":2}]
[null,"Informations à transmettre à l'inspection :"]
[]
[null,null,null,null,null,null,null,null,""]
[]
[null,"Partie reservée à l'inspection :"]

{"sheet":"9830400T","index":44,"n_rows":83,"n_cols":10,"rows_kept":83,"cut":false,"hidden":false,"merged":[[0,3,0,5],[2,1,3,1],[2,2,3,2],[2,3,3,3],[2,4,2,5],[2,7,3,7],[4,0,9,0],[4,2,9,2],[10,0,15,0],[10,2,15,2],[16,0,21,0],[16,2,21,2],[2,6,3,6],[58,0,63,0],[58,2,63,2],[22,0,27,0],[22,2,27,2],[28,0,33,0],[28,2,33,2],[34,0,39,0],[34,2,39,2],[64,0,69,0],[64,2,69,2],[70,0,75,0],[70,2,75,2],[40,0,45,0],[40,2,45,2],[46,0,51,0],[46,2,51,2],[52,0,57,0],[52,2,57,2]]}
["R","DNB 2014","9830400T","CLG DE NATHALO - LIFOU",null,null,"PROVINCE DES ILES","Académie de Nouvelle-Calédonie",{"$f":"IF(C1=\"\",\"\",VLOOKUP(C1,etab,4,FALSE))","v":"privé"}]
["GEBEPS_2014_IPR_PROTOCOLES_privé_9830400T.xls",null,null,null,"",null,null,null,{"$f":"Données!M11","v":"V3_29/10/13"}]
[null,"CLASSES            évaluées pour le DNB","NOM \nde l'enseignant responsable de la classe","Activités","Compétences\npropres",null,"dates des évaluations","dates des rattrapages",null,"nbre APSA\n/ classe"]
[null,null,null,null,"CP","Liste"]
["Classe 1","Classe","PUGET","Foot","CP4","N","2014-04-23","2014-05-07",{"$f":"IF(ISERROR(E5),1,\"\")","v":""},{"$f":"IF(COUNTA(D5:D10)<=2,\"\",COUNTA(D5:D10))","v":3}]
[null,"3A gp1",null,"Javelot","CP1","N","2014-07-23","2014-07-30",{"$f":"IF(ISERROR(E6),1,\"\")","v":""}]
[null,null,null,"Acrosport","CP3","N","2014-10-29","2014-11-05",""]
[null,"nbre d'élèves :   ",null,null,"","",null,null,""]
[null,16,null,null,"","",null,null,""]
[null,null,null,null,"","",null,null,""]
["Classe 2","Classe","PUGET","Volley","CP4","N","2014-04-30","2014-05-07","",{"$f":"IF(COUNTA(D11:D16)<=2,\"\",COUNTA(D11:D16))","v":3}]
[null,"3A gp2",null,"Javelot","CP1","N","2014-07-23","2014-07-30",""]
[null,null,null,"Acrosport","CP3","N","2014-10-29","2014-11-05",""]
[null,"nbre d'élèves :   ",null,null,"","",null,null,""]
[null,11,null,null,"","",null,null,""]
[null,null,null,null,"","",null,null,""]
["Classe 3","Classe","prof3",null,"","",null,null,"",{"$f":"IF(COUNTA(D17:D22)<=2,\"\",COUNTA(D17:D22))","v":""}]
[null,"3è3",null,null,"","",null,null,""]
[null,null,null,null,"","",null,null,""]
[null,"nbre d'élèves :   ",null,null,"","",null,null,""]
[null,null,null,null,"","",null,null,""]
[null,null,null,null,"","",null,null,""]
["Classe 4","Classe","prof4",null,"","",null,null,"",{"$f":"IF(COUNTA(D23:D28)<=2,\"\",COUNTA(D23:D28))","v":""}]
[null,"3è4",null,null,"","",null,null,""]
[null,null,null,null,"","",null,null,""]
[null,"nbre d'élèves :   ",null,null,"","",null,null,""]
[null,null,null,null,"","",null,null,""]
[null,null,null,null,"","",null,null,""]
["Classe 5","Classe","prof5",null,"","",null,null,"",{"$f":"IF(COUNTA(D29:D34)<=2,\"\",COUNTA(D29:D34))","v":""}]
[null,"3è5",null,null,"","",null,null,""]
[null,null,null,null,"","",null,null,""]
[null,"nbre d'élèves :   ",null,null,"","",null,null,""]
[null,null,null,null,"","",null,null,""]
[null,null,null,null,"","",null,null,""]
["Classe 6","Classe","prof6",null,"","",null,null,"",{"$f":"IF(COUNTA(D35:D40)<=2,\"\",COUNTA(D35:D40))","v":""}]
[null,"3è6",null,null,"","",null,null,""]
[null,null,null,null,"","",null,null,""]
[null,"nbre d'élèves :   ",null,null,"","",null,null,""]
[null,null,null,null,"","",null,null,""]
[null,null,null,null,"","",null,null,""]
["Classe 7","Classe","prof7",null,"","",null,null,{"$f":"IF(ISERROR(E41),1,\"\")","v":""},{"$f":"IF(COUNTA(D41:D46)<=2,\"\",COUNTA(D41:D46))","v":""}]
[null,"3è7",null,null,"","",null,null,{"$f":"IF(ISERROR(E42),1,\"\")","v":""}]
[null,null,null,null,"","",null,null,""]
[null,"nbre d'élèves :   ",null,null,"","",null,null,""]
[null,null,null,null,"","",null,null,""]
[null,null,null,null,"","",null,null,""]
["Classe 8","Classe","prof8",null,"","",null,null,"",{"$f":"IF(COUNTA(D47:D52)<=2,\"\",COUNTA(D47:D52))","v":""}]
[null,"3è8",null,null,"","",null,null,""]
[null,null,null,null,"","",null,null,""]
[null,"nbre d'élèves :   ",null,null,"","",null,null,""]
[null,null,null,null,"","",null,null,""]
[null,null,null,null,"","",null,null,""]
["Classe 9","Classe","prof9",null,"","",null,null,"",{"$f":"IF(COUNTA(D53:D58)<=2,\"\",COUNTA(D53:D58))","v":""}]
[null,"3è9",null,null,"","",null,null,""]
[null,null,null,null,"","",null,null,""]
[null,"nbre d'élèves :   ",null,null,"","",null,null,""]
[null,null,null,null,"","",null,null,""]
[null,null,null,null,"","",null,null,""]
["Classe 10","Classe","prof10",null,"","",null,null,"",{"$f":"IF(COUNTA(D59:D64)<=2,\"\",COUNTA(D59:D64))","v":""}]
[null,"3è10",null,null,"","",null,null,""]
[null,null,null,null,"","",null,null,""]
[null,"nbre d'élèves :   ",null,null,"","",null,null,""]
[null,null,null,null,"","",null,null,""]
[null,null,null,null,"","",null,null,""]
["Classe 11","Classe","prof11",null,"","",null,null,"",{"$f":"IF(COUNTA(D65:D70)<=2,\"\",COUNTA(D65:D70))","v":""}]
[null,"3è11",null,null,"","",null,null,""]
[null,null,null,null,"","",null,null,""]
[null,"nbre d'élèves :   ",null,null,"","",null,null,""]
[null,null,null,null,"","",null,null,""]
[null,null,null,null,"","",null,null,""]
["Classe 12","Classe","prof12",null,"","",null,null,"",{"$f":"IF(COUNTA(D71:D76)<=2,\"\",COUNTA(D71:D76))","v":""}]
[null,"3è12",null,null,"","",null,null,""]
[null,null,null,null,"","",null,null,""]
[null,"nbre d'élèves :   ",null,null,"","",null,null,""]
[null,null,null,null,"","",null,null,""]
[null,null,null,null,"","",null,null,""]
[null,null,null,null,null,null,null,null,{"$f":"IF(COUNT(I5:I76)=0,\"\",\"Attention, une ou plusieurs APSA du protocole sont mal saisies!\")","v":""},{"$f":"AVERAGE(J5:J71)","v":3}]
[null,"Date de validation par le chef d'établissement :",null,null,null,null,null,null,null,{"$f":"COUNT(J5:J71)","v":2}]
[null,"Informations à transmettre à l'inspection :"]
[]
[null,null,null,null,null,null,null,null,""]
[]
[null,"Partie reservée à l'inspection :"]

{"sheet":"9830392j","index":45,"n_rows":83,"n_cols":10,"rows_kept":83,"cut":false,"hidden":false,"merged":[[0,3,0,5],[2,1,3,1],[2,2,3,2],[2,3,3,3],[2,4,2,5],[2,7,3,7],[4,0,9,0],[4,2,9,2],[10,0,15,0],[10,2,15,2],[16,0,21,0],[16,2,21,2],[2,6,3,6],[58,0,63,0],[58,2,63,2],[22,0,27,0],[22,2,27,2],[28,0,33,0],[28,2,33,2],[34,0,39,0],[34,2,39,2],[64,0,69,0],[64,2,69,2],[70,0,75,0],[70,2,75,2],[40,0,45,0],[40,2,45,2],[46,0,51,0],[46,2,51,2],[52,0,57,0],[52,2,57,2]]}
["R","DNB 2014","9830392j","CLG TAREMEN - MARE",null,null,"PROVINCE DES ILES","Académie de Nouvelle-Calédonie",{"$f":"IF(C1=\"\",\"\",VLOOKUP(C1,etab,4,FALSE))","v":"privé"}]
["GEBEPS_2014_IPR_PROTOCOLES_privé_9830392j.xls",null,null,null,"",null,null,null,{"$f":"Données!M11","v":"V3_29/10/13"}]
[null,"CLASSES            évaluées pour le DNB","NOM \nde l'enseignant responsable de la classe","Activités","Compétences\npropres",null,"dates des évaluations","dates des rattrapages",null,"nbre APSA\n/ classe"]
[null,null,null,null,"CP","Liste"]
["Classe 1","Classe","Marc WAIA","JAVELOT","CP1","N","2014-10-27","2014-10-31",{"$f":"IF(ISERROR(E5),1,\"\")","v":""},{"$f":"IF(COUNTA(D5:D10)<=2,\"\",COUNTA(D5:D10))","v":3}]
[null,"3è1",null,"FOOT","CP4","N","2014-10-27","2014-10-31",{"$f":"IF(ISERROR(E6),1,\"\")","v":""}]
[null,null,null,"CO","CP2","N","2014-10-27","2014-10-31",""]
[null,"nbre d'élèves :   ",null,null,"","",null,null,""]
[null,9,null,null,"","",null,null,""]
[null,null,null,null,"","",null,null,""]
["Classe 2","Classe","Marc WAIA","JAVELOT","CP1","N","2014-10-27","2014-10-31","",{"$f":"IF(COUNTA(D11:D16)<=2,\"\",COUNTA(D11:D16))","v":3}]
[null,"3è2",null,"VOLLEY","CP4","N","2014-10-27","2014-10-31",""]
[null,null,null,"DANSE","CP3","N","2014-10-27","2014-10-31",""]
[null,"nbre d'élèves :   ",null,null,"","",null,null,""]
[null,24,null,null,"","",null,null,""]
[null,null,null,null,"","",null,null,""]
["Classe 3","Classe","prof3",null,"","",null,null,"",{"$f":"IF(COUNTA(D17:D22)<=2,\"\",COUNTA(D17:D22))","v":""}]
[null,"3è3",null,null,"","",null,null,""]
[null,null,null,null,"","",null,null,""]
[null,"nbre d'élèves :   ",null,null,"","",null,null,""]
[null,null,null,null,"","",null,null,""]
[null,null,null,null,"","",null,null,""]
["Classe 4","Classe","prof4",null,"","",null,null,"",{"$f":"IF(COUNTA(D23:D28)<=2,\"\",COUNTA(D23:D28))","v":""}]
[null,"3è4",null,null,"","",null,null,""]
[null,null,null,null,"","",null,null,""]
[null,"nbre d'élèves :   ",null,null,"","",null,null,""]
[null,null,null,null,"","",null,null,""]
[null,null,null,null,"","",null,null,""]
["Classe 5","Classe","prof5",null,"","",null,null,"",{"$f":"IF(COUNTA(D29:D34)<=2,\"\",COUNTA(D29:D34))","v":""}]
[null,"3è5",null,null,"","",null,null,""]
[null,null,null,null,"","",null,null,""]
[null,"nbre d'élèves :   ",null,null,"","",null,null,""]
[null,null,null,null,"","",null,null,""]
[null,null,null,null,"","",null,null,""]
["Classe 6","Classe","prof6",null,"","",null,null,"",{"$f":"IF(COUNTA(D35:D40)<=2,\"\",COUNTA(D35:D40))","v":""}]
[null,"3è6",null,null,"","",null,null,""]
[null,null,null,null,"","",null,null,""]
[null,"nbre d'élèves :   ",null,null,"","",null,null,""]
[null,null,null,null,"","",null,null,""]
[null,null,null,null,"","",null,null,""]
["Classe 7","Classe","prof7",null,"","",null,null,{"$f":"IF(ISERROR(E41),1,\"\")","v":""},{"$f":"IF(COUNTA(D41:D46)<=2,\"\",COUNTA(D41:D46))","v":""}]
[null,"3è7",null,null,"","",null,null,{"$f":"IF(ISERROR(E42),1,\"\")","v":""}]
[null,null,null,null,"","",null,null,""]
[null,"nbre d'élèves :   ",null,null,"","",null,null,""]
[null,null,null,null,"","",null,null,""]
[null,null,null,null,"","",null,null,""]
["Classe 8","Classe","prof8",null,"","",null,null,"",{"$f":"IF(COUNTA(D47:D52)<=2,\"\",COUNTA(D47:D52))","v":""}]
[null,"3è8",null,null,"","",null,null,""]
[null,null,null,null,"","",null,null,""]
[null,"nbre d'élèves :   ",null,null,"","",null,null,""]
[null,null,null,null,"","",null,null,""]
[null,null,null,null,"","",null,null,""]
["Classe 9","Classe","prof9",null,"","",null,null,"",{"$f":"IF(COUNTA(D53:D58)<=2,\"\",COUNTA(D53:D58))","v":""}]
[null,"3è9",null,null,"","",null,null,""]
[null,null,null,null,"","",null,null,""]
[null,"nbre d'élèves :   ",null,null,"","",null,null,""]
[null,null,null,null,"","",null,null,""]
[null,null,null,null,"","",null,null,""]
["Classe 10","Classe","prof10",null,"","",null,null,"",{"$f":"IF(COUNTA(D59:D64)<=2,\"\",COUNTA(D59:D64))","v":""}]
[null,"3è10",null,null,"","",null,null,""]
[null,null,null,null,"","",null,null,""]
[null,"nbre d'élèves :   ",null,null,"","",null,null,""]
[null,null,null,null,"","",null,null,""]
[null,null,null,null,"","",null,null,""]
["Classe 11","Classe","prof11",null,"","",null,null,"",{"$f":"IF(COUNTA(D65:D70)<=2,\"\",COUNTA(D65:D70))","v":""}]
[null,"3è11",null,null,"","",null,null,""]
[null,null,null,null,"","",null,null,""]
[null,"nbre d'élèves :   ",null,null,"","",null,null,""]
[null,null,null,null,"","",null,null,""]
[null,null,null,null,"","",null,null,""]
["Classe 12","Classe","prof12",null,"","",null,null,"",{"$f":"IF(COUNTA(D71:D76)<=2,\"\",COUNTA(D71:D76))","v":""}]
[null,"3è12",null,null,"","",null,null,""]
[null,null,null,null,"","",null,null,""]
[null,"nbre d'élèves :   ",null,null,"","",null,null,""]
[null,null,null,null,"","",null,null,""]
[null,null,null,null,"","",null,null,""]
[null,null,null,null,null,null,null,null,{"$f":"IF(COUNT(I5:I76)=0,\"\",\"Attention, une ou plusieurs APSA du protocole sont mal saisies!\")","v":""},{"$f":"AVERAGE(J5:J71)","v":3}]
[null,"Date de validation par le chef d'établissement :",null,null,null,null,null,null,null,{"$f":"COUNT(J5:J71)","v":2}]
[null,"Informations à transmettre à l'inspection :"]
[]
[null,null,null,null,null,null,null,null,""]
[]
[null,"Partie reservée à l'inspection :"]

{"sheet":"9830382Y","index":46,"n_rows":83,"n_cols":10,"rows_kept":83,"cut":false,"hidden":false,"merged":[[0,3,0,5],[2,1,3,1],[2,2,3,2],[2,3,3,3],[2,4,2,5],[2,7,3,7],[4,0,9,0],[4,2,9,2],[10,0,15,0],[10,2,15,2],[16,0,21,0],[16,2,21,2],[2,6,3,6],[58,0,63,0],[58,2,63,2],[22,0,27,0],[22,2,27,2],[28,0,33,0],[28,2,33,2],[34,0,39,0],[34,2,39,2],[64,0,69,0],[64,2,69,2],[70,0,75,0],[70,2,75,2],[40,0,45,0],[40,2,45,2],[46,0,51,0],[46,2,51,2],[52,0,57,0],[52,2,57,2]]}
["R","DNB 2014","9830382Y","CLG J.B. VIGOUROUX - POINDIMIE",null,null,"PROVINCE NORD","Académie de Nouvelle-Calédonie",{"$f":"IF(C1=\"\",\"\",VLOOKUP(C1,etab,4,FALSE))","v":"privé"}]
["GEBEPS_2014_IPR_PROTOCOLES_privé_9830382Y.xls",null,null,null,"",null,null,null,{"$f":"Données!M11","v":"V3_29/10/13"}]
[null,"CLASSES            évaluées pour le DNB","NOM \nde l'enseignant responsable de la classe","Activités","Compétences\npropres",null,"dates des évaluations","dates des rattrapages",null,"nbre APSA\n/ classe"]
[null,null,null,null,"CP","Liste"]
["Classe 1","Classe","Christophe RAVILY","Javelot","CP1","N","2014-04-28","2014-05-05",{"$f":"IF(ISERROR(E5),1,\"\")","v":""},{"$f":"IF(COUNTA(D5:D10)<=2,\"\",COUNTA(D5:D10))","v":3}]
[null,"3èA",null,"Arts du cirque","CP3","N","2014-08-21","2014-08-28",{"$f":"IF(ISERROR(E6),1,\"\")","v":""}]
[null,null,null,"Badminton","CP4","N","2014-10-27","2014-11-03",""]
[null,"nbre d'élèves :   ",null,null,"","",null,null,""]
[null,18,null,null,"","",null,null,""]
[null,null,null,null,"","",null,null,""]
["Classe 2","Classe","Fabien COURT","Javelot","CP1","N","2014-04-28","2014-05-05","",{"$f":"IF(COUNTA(D11:D16)<=2,\"\",COUNTA(D11:D16))","v":3}]
[null,"3èB",null,"Arts du cirque","CP3","N","2014-08-21","2014-08-28",""]
[null,null,null,"Badminton","CP4","N","2014-10-27","2014-11-03",""]
[null,"nbre d'élèves :   ",null,null,"","",null,null,""]
[null,18,null,null,"","",null,null,""]
[null,null,null,null,"","",null,null,""]
["Classe 3","Classe","prof3",null,"","",null,null,"",{"$f":"IF(COUNTA(D17:D22)<=2,\"\",COUNTA(D17:D22))","v":""}]
[null,"3è3",null,null,"","",null,null,""]
[null,null,null,null,"","",null,null,""]
[null,"nbre d'élèves :   ",null,null,"","",null,null,""]
[null,null,null,null,"","",null,null,""]
[null,null,null,null,"","",null,null,""]
["Classe 4","Classe","prof4",null,"","",null,null,"",{"$f":"IF(COUNTA(D23:D28)<=2,\"\",COUNTA(D23:D28))","v":""}]
[null,"3è4",null,null,"","",null,null,""]
[null,null,null,null,"","",null,null,""]
[null,"nbre d'élèves :   ",null,null,"","",null,null,""]
[null,null,null,null,"","",null,null,""]
[null,null,null,null,"","",null,null,""]
["Classe 5","Classe","prof5",null,"","",null,null,"",{"$f":"IF(COUNTA(D29:D34)<=2,\"\",COUNTA(D29:D34))","v":""}]
[null,"3è5",null,null,"","",null,null,""]
[null,null,null,null,"","",null,null,""]
[null,"nbre d'élèves :   ",null,null,"","",null,null,""]
[null,null,null,null,"","",null,null,""]
[null,null,null,null,"","",null,null,""]
["Classe 6","Classe","prof6",null,"","",null,null,"",{"$f":"IF(COUNTA(D35:D40)<=2,\"\",COUNTA(D35:D40))","v":""}]
[null,"3è6",null,null,"","",null,null,""]
[null,null,null,null,"","",null,null,""]
[null,"nbre d'élèves :   ",null,null,"","",null,null,""]
[null,null,null,null,"","",null,null,""]
[null,null,null,null,"","",null,null,""]
["Classe 7","Classe","prof7",null,"","",null,null,{"$f":"IF(ISERROR(E41),1,\"\")","v":""},{"$f":"IF(COUNTA(D41:D46)<=2,\"\",COUNTA(D41:D46))","v":""}]
[null,"3è7",null,null,"","",null,null,{"$f":"IF(ISERROR(E42),1,\"\")","v":""}]
[null,null,null,null,"","",null,null,""]
[null,"nbre d'élèves :   ",null,null,"","",null,null,""]
[null,null,null,null,"","",null,null,""]
[null,null,null,null,"","",null,null,""]
["Classe 8","Classe","prof8",null,"","",null,null,"",{"$f":"IF(COUNTA(D47:D52)<=2,\"\",COUNTA(D47:D52))","v":""}]
[null,"3è8",null,null,"","",null,null,""]
[null,null,null,null,"","",null,null,""]
[null,"nbre d'élèves :   ",null,null,"","",null,null,""]
[null,null,null,null,"","",null,null,""]
[null,null,null,null,"","",null,null,""]
["Classe 9","Classe","prof9",null,"","",null,null,"",{"$f":"IF(COUNTA(D53:D58)<=2,\"\",COUNTA(D53:D58))","v":""}]
[null,"3è9",null,null,"","",null,null,""]
[null,null,null,null,"","",null,null,""]
[null,"nbre d'élèves :   ",null,null,"","",null,null,""]
[null,null,null,null,"","",null,null,""]
[null,null,null,null,"","",null,null,""]
["Classe 10","Classe","prof10",null,"","",null,null,"",{"$f":"IF(COUNTA(D59:D64)<=2,\"\",COUNTA(D59:D64))","v":""}]
[null,"3è10",null,null,"","",null,null,""]
[null,null,null,null,"","",null,null,""]
[null,"nbre d'élèves :   ",null,null,"","",null,null,""]
[null,null,null,null,"","",null,null,""]
[null,null,null,null,"","",null,null,""]
["Classe 11","Classe","prof11",null,"","",null,null,"",{"$f":"IF(COUNTA(D65:D70)<=2,\"\",COUNTA(D65:D70))","v":""}]
[null,"3è11",null,null,"","",null,null,""]
[null,null,null,null,"","",null,null,""]
[null,"nbre d'élèves :   ",null,null,"","",null,null,""]
[null,null,null,null,"","",null,null,""]
[null,null,null,null,"","",null,null,""]
["Classe 12","Classe","prof12",null,"","",null,null,"",{"$f":"IF(COUNTA(D71:D76)<=2,\"\",COUNTA(D71:D76))","v":""}]
[null,"3è12",null,null,"","",null,null,""]
[null,null,null,null,"","",null,null,""]
[null,"nbre d'élèves :   ",null,null,"","",null,null,""]
[null,null,null,null,"","",null,null,""]
[null,null,null,null,"","",null,null,""]
[null,null,null,null,null,null,null,null,{"$f":"IF(COUNT(I5:I76)=0,\"\",\"Attention, une ou plusieurs APSA du protocole sont mal saisies!\")","v":""},{"$f":"AVERAGE(J5:J71)","v":3}]
[null,"Date de validation par le chef d'établissement :",null,null,null,null,null,null,null,{"$f":"COUNT(J5:J71)","v":2}]
[null,"Informations à transmettre à l'inspection :"]
[]
[null,null,null,null,null,null,null,null,""]
[]
[null,"Partie reservée à l'inspection :"]

{"sheet":"9830381X","index":47,"n_rows":83,"n_cols":10,"rows_kept":83,"cut":false,"hidden":false,"merged":[[70,0,75,0],[70,2,75,2],[58,0,63,0],[58,2,63,2],[64,0,69,0],[64,2,69,2],[40,0,45,0],[40,2,45,2],[46,0,51,0],[46,2,51,2],[52,0,57,0],[52,2,57,2],[22,0,27,0],[22,2,27,2],[28,0,33,0],[28,2,33,2],[34,0,39,0],[34,2,39,2],[2,7,3,7],[4,0,9,0],[4,2,9,2],[10,0,15,0],[10,2,15,2],[16,0,21,0],[16,2,21,2],[0,3,0,5],[2,1,3,1],[2,2,3,2],[2,3,3,3],[2,4,2,5],[2,6,3,6]]}
["R","DNB 2014","9830381X","CLG SAINT DOMINIQUE SAVIO - LA FOA",null,null,"PROVINCE SUD","Académie de Nouvelle-Calédonie",{"$f":"IF(C1=\"\",\"\",VLOOKUP(C1,etab,4,FALSE))","v":"privé"}]
["GEBEPS_2014_IPR_PROTOCOLES_privé_9830381X.xls",null,null,null,"",null,null,null,{"$f":"Données!M11","v":"V3_29/10/13"}]
[null,"CLASSES            évaluées pour le DNB","NOM \nde l'enseignant responsable de la classe","Activités","Compétences\npropres",null,"dates des évaluations","dates des rattrapages",null,"nbre APSA\n/ classe"]
[null,null,null,null,"CP","Liste"]
["Classe 1","Classe","M.SAGE","Foot","CP4","N","2014-05-05","2014-05-12",{"$f":"IF(ISERROR(E5),1,\"\")","v":""},{"$f":"IF(COUNTA(D5:D10)<=2,\"\",COUNTA(D5:D10))","v":3}]
[null,"3èA",null,"CO","CP2","N","2014-08-25","2014-09-01",{"$f":"IF(ISERROR(E6),1,\"\")","v":""}]
[null,null,null,"Javelot","CP1","N","2014-08-29","2014-09-05",""]
[null,"nbre d'élèves :   ",null,null,"","",null,null,""]
[null,24,null,null,"","",null,null,""]
[null,null,null,null,"","",null,null,""]
["Classe 2","Classe","M.SAGE","Foot","CP4","N","2014-05-06","2014-05-13","",{"$f":"IF(COUNTA(D11:D16)<=2,\"\",COUNTA(D11:D16))","v":3}]
[null,"3èB",null,"CO","CP2","N","2014-08-26","2014-09-02",""]
[null,null,null,"Javelot","CP1","N","2014-05-15","2014-05-22",""]
[null,"nbre d'élèves :   ",null,null,"","",null,null,""]
[null,23,null,null,"","",null,null,""]
[null,null,null,null,"","",null,null,""]
["Classe 3","Classe","prof3",null,"","",null,null,"",{"$f":"IF(COUNTA(D17:D22)<=2,\"\",COUNTA(D17:D22))","v":""}]
[null,"3è3",null,null,"","",null,null,""]
[null,null,null,null,"","",null,null,""]
[null,"nbre d'élèves :   ",null,null,"","",null,null,""]
[null,null,null,null,"","",null,null,""]
[null,null,null,null,"","",null,null,""]
["Classe 4","Classe","prof4",null,"","",null,null,"",{"$f":"IF(COUNTA(D23:D28)<=2,\"\",COUNTA(D23:D28))","v":""}]
[null,"3è4",null,null,"","",null,null,""]
[null,null,null,null,"","",null,null,""]
[null,"nbre d'élèves :   ",null,null,"","",null,null,""]
[null,null,null,null,"","",null,null,""]
[null,null,null,null,"","",null,null,""]
["Classe 5","Classe","prof5",null,"","",null,null,"",{"$f":"IF(COUNTA(D29:D34)<=2,\"\",COUNTA(D29:D34))","v":""}]
[null,"3è5",null,null,"","",null,null,""]
[null,null,null,null,"","",null,null,""]
[null,"nbre d'élèves :   ",null,null,"","",null,null,""]
[null,null,null,null,"","",null,null,""]
[null,null,null,null,"","",null,null,""]
["Classe 6","Classe","prof6",null,"","",null,null,"",{"$f":"IF(COUNTA(D35:D40)<=2,\"\",COUNTA(D35:D40))","v":""}]
[null,"3è6",null,null,"","",null,null,""]
[null,null,null,null,"","",null,null,""]
[null,"nbre d'élèves :   ",null,null,"","",null,null,""]
[null,null,null,null,"","",null,null,""]
[null,null,null,null,"","",null,null,""]
["Classe 7","Classe","prof7",null,"","",null,null,{"$f":"IF(ISERROR(E41),1,\"\")","v":""},{"$f":"IF(COUNTA(D41:D46)<=2,\"\",COUNTA(D41:D46))","v":""}]
[null,"3è7",null,null,"","",null,null,{"$f":"IF(ISERROR(E42),1,\"\")","v":""}]
[null,null,null,null,"","",null,null,""]
[null,"nbre d'élèves :   ",null,null,"","",null,null,""]
[null,null,null,null,"","",null,null,""]
[null,null,null,null,"","",null,null,""]
["Classe 8","Classe","prof8",null,"","",null,null,"",{"$f":"IF(COUNTA(D47:D52)<=2,\"\",COUNTA(D47:D52))","v":""}]
[null,"3è8",null,null,"","",null,null,""]
[null,null,null,null,"","",null,null,""]
[null,"nbre d'élèves :   ",null,null,"","",null,null,""]
[null,null,null,null,"","",null,null,""]
[null,null,null,null,"","",null,null,""]
["Classe 9","Classe","prof9",null,"","",null,null,"",{"$f":"IF(COUNTA(D53:D58)<=2,\"\",COUNTA(D53:D58))","v":""}]
[null,"3è9",null,null,"","",null,null,""]
[null,null,null,null,"","",null,null,""]
[null,"nbre d'élèves :   ",null,null,"","",null,null,""]
[null,null,null,null,"","",null,null,""]
[null,null,null,null,"","",null,null,""]
["Classe 10","Classe","prof10",null,"","",null,null,"",{"$f":"IF(COUNTA(D59:D64)<=2,\"\",COUNTA(D59:D64))","v":""}]
[null,"3è10",null,null,"","",null,null,""]
[null,null,null,null,"","",null,null,""]
[null,"nbre d'élèves :   ",null,null,"","",null,null,""]
[null,null,null,null,"","",null,null,""]
[null,null,null,null,"","",null,null,""]
["Classe 11","Classe","prof11",null,"","",null,null,"",{"$f":"IF(COUNTA(D65:D70)<=2,\"\",COUNTA(D65:D70))","v":""}]
[null,"3è11",null,null,"","",null,null,""]
[null,null,null,null,"","",null,null,""]
[null,"nbre d'élèves :   ",null,null,"","",null,null,""]
[null,null,null,null,"","",null,null,""]
[null,null,null,null,"","",null,null,""]
["Classe 12","Classe","prof12",null,"","",null,null,"",{"$f":"IF(COUNTA(D71:D76)<=2,\"\",COUNTA(D71:D76))","v":""}]
[null,"3è12",null,null,"","",null,null,""]
[null,null,null,null,"","",null,null,""]
[null,"nbre d'élèves :   ",null,null,"","",null,null,""]
[null,null,null,null,"","",null,null,""]
[null,null,null,null,"","",null,null,""]
[null,null,null,null,null,null,null,null,{"$f":"IF(COUNT(I5:I76)=0,\"\",\"Attention, une ou plusieurs APSA du protocole sont mal saisies!\")","v":""},{"$f":"AVERAGE(J5:J71)","v":3}]
[null,"Date de validation par le chef d'établissement :",null,null,null,null,"le 28/05/14",null,null,{"$f":"COUNT(J5:J71)","v":2}]
[null,"Informations à transmettre à l'inspection :"]
[]
[null,null,null,null,null,null,null,null,""]
[]
[null,"Partie reservée à l'inspection :"]

{"sheet":"9830354T","index":48,"n_rows":83,"n_cols":10,"rows_kept":83,"cut":false,"hidden":false,"merged":[[0,3,0,5],[2,1,3,1],[2,2,3,2],[2,3,3,3],[2,4,2,5],[2,7,3,7],[4,0,9,0],[4,2,9,2],[10,0,15,0],[10,2,15,2],[16,0,21,0],[16,2,21,2],[2,6,3,6],[58,0,63,0],[58,2,63,2],[22,0,27,0],[22,2,27,2],[28,0,33,0],[28,2,33,2],[34,0,39,0],[34,2,39,2],[64,0,69,0],[64,2,69,2],[70,0,75,0],[70,2,75,2],[40,0,45,0],[40,2,45,2],[46,0,51,0],[46,2,51,2],[52,0,57,0],[52,2,57,2]]}
["R","DNB 2014","9830354T","CLG SAINT JOSEPH - VAO ILES DES PINS",null,null,"PROVINCE DES ILES","Académie de Nouvelle-Calédonie",{"$f":"IF(C1=\"\",\"\",VLOOKUP(C1,etab,4,FALSE))","v":"privé"}]
["GEBEPS_2014_IPR_PROTOCOLES_privé_9830354T.xls",null,null,null,"",null,null,null,{"$f":"Données!M11","v":"V3_29/10/13"}]
[null,"CLASSES            évaluées pour le DNB","NOM \nde l'enseignant responsable de la classe","Activités","Compétences\npropres",null,"dates des évaluations","dates des rattrapages",null,"nbre APSA\n/ classe"]
[null,null,null,null,"CP","Liste"]
["Classe 1","Classe","MARTINIERE","Hauteur","CP1","N","2014-11-05","2014-11-11",{"$f":"IF(ISERROR(E5),1,\"\")","v":""},{"$f":"IF(COUNTA(D5:D10)<=2,\"\",COUNTA(D5:D10))","v":5}]
[null,"3èA",null,"Javelot","CP1","N","2014-05-07","2014-05-14",{"$f":"IF(ISERROR(E6),1,\"\")","v":""}]
[null,null,null,"Aérobic","CP3","N","2014-11-07","2014-11-11",""]
[null,"nbre d'élèves :   ",null,"Volley","CP4","N","2014-05-07","2014-05-16",""]
[null,16,null,"Tennis de table","CP4","N","2014-07-25","2014-08-01",""]
[null,null,null,null,"","",null,null,""]
["Classe 2","Classe","MAILLOT","Hauteur","CP1","N","2014-11-05","2014-11-11","",{"$f":"IF(COUNTA(D11:D16)<=2,\"\",COUNTA(D11:D16))","v":5}]
[null,"3èB",null,"Javelot","CP1","N","2014-05-07","2014-05-13",""]
[null,null,null,"Aérobic","CP3","N","2014-11-07","2014-11-11",""]
[null,"nbre d'élèves :   ",null,"Volley","CP4","N","2014-07-25","2014-08-01",""]
[null,14,null,"Tennis de table","CP4","N","2014-05-07","2014-05-13",""]
[null,null,null,null,"","",null,null,""]
["Classe 3","Classe","prof3",null,"","",null,null,"",{"$f":"IF(COUNTA(D17:D22)<=2,\"\",COUNTA(D17:D22))","v":""}]
[null,"3è3",null,null,"","",null,null,""]
[null,null,null,null,"","",null,null,""]
[null,"nbre d'élèves :   ",null,null,"","",null,null,""]
[null,null,null,null,"","",null,null,""]
[null,null,null,null,"","",null,null,""]
["Classe 4","Classe","prof4",null,"","",null,null,"",{"$f":"IF(COUNTA(D23:D28)<=2,\"\",COUNTA(D23:D28))","v":""}]
[null,"3è4",null,null,"","",null,null,""]
[null,null,null,null,"","",null,null,""]
[null,"nbre d'élèves :   ",null,null,"","",null,null,""]
[null,null,null,null,"","",null,null,""]
[null,null,null,null,"","",null,null,""]
["Classe 5","Classe","prof5",null,"","",null,null,"",{"$f":"IF(COUNTA(D29:D34)<=2,\"\",COUNTA(D29:D34))","v":""}]
[null,"3è5",null,null,"","",null,null,""]
[null,null,null,null,"","",null,null,""]
[null,"nbre d'élèves :   ",null,null,"","",null,null,""]
[null,null,null,null,"","",null,null,""]
[null,null,null,null,"","",null,null,""]
["Classe 6","Classe","prof6",null,"","",null,null,"",{"$f":"IF(COUNTA(D35:D40)<=2,\"\",COUNTA(D35:D40))","v":""}]
[null,"3è6",null,null,"","",null,null,""]
[null,null,null,null,"","",null,null,""]
[null,"nbre d'élèves :   ",null,null,"","",null,null,""]
[null,null,null,null,"","",null,null,""]
[null,null,null,null,"","",null,null,""]
["Classe 7","Classe","prof7",null,"","",null,null,{"$f":"IF(ISERROR(E41),1,\"\")","v":""},{"$f":"IF(COUNTA(D41:D46)<=2,\"\",COUNTA(D41:D46))","v":""}]
[null,"3è7",null,null,"","",null,null,{"$f":"IF(ISERROR(E42),1,\"\")","v":""}]
[null,null,null,null,"","",null,null,""]
[null,"nbre d'élèves :   ",null,null,"","",null,null,""]
[null,null,null,null,"","",null,null,""]
[null,null,null,null,"","",null,null,""]
["Classe 8","Classe","prof8",null,"","",null,null,"",{"$f":"IF(COUNTA(D47:D52)<=2,\"\",COUNTA(D47:D52))","v":""}]
[null,"3è8",null,null,"","",null,null,""]
[null,null,null,null,"","",null,null,""]
[null,"nbre d'élèves :   ",null,null,"","",null,null,""]
[null,null,null,null,"","",null,null,""]
[null,null,null,null,"","",null,null,""]
["Classe 9","Classe","prof9",null,"","",null,null,"",{"$f":"IF(COUNTA(D53:D58)<=2,\"\",COUNTA(D53:D58))","v":""}]
[null,"3è9",null,null,"","",null,null,""]
[null,null,null,null,"","",null,null,""]
[null,"nbre d'élèves :   ",null,null,"","",null,null,""]
[null,null,null,null,"","",null,null,""]
[null,null,null,null,"","",null,null,""]
["Classe 10","Classe","prof10",null,"","",null,null,"",{"$f":"IF(COUNTA(D59:D64)<=2,\"\",COUNTA(D59:D64))","v":""}]
[null,"3è10",null,null,"","",null,null,""]
[null,null,null,null,"","",null,null,""]
[null,"nbre d'élèves :   ",null,null,"","",null,null,""]
[null,null,null,null,"","",null,null,""]
[null,null,null,null,"","",null,null,""]
["Classe 11","Classe","prof11",null,"","",null,null,"",{"$f":"IF(COUNTA(D65:D70)<=2,\"\",COUNTA(D65:D70))","v":""}]
[null,"3è11",null,null,"","",null,null,""]
[null,null,null,null,"","",null,null,""]
[null,"nbre d'élèves :   ",null,null,"","",null,null,""]
[null,null,null,null,"","",null,null,""]
[null,null,null,null,"","",null,null,""]
["Classe 12","Classe","prof12",null,"","",null,null,"",{"$f":"IF(COUNTA(D71:D76)<=2,\"\",COUNTA(D71:D76))","v":""}]
[null,"3è12",null,null,"","",null,null,""]
[null,null,null,null,"","",null,null,""]
[null,"nbre d'élèves :   ",null,null,"","",null,null,""]
[null,null,null,null,"","",null,null,""]
[null,null,null,null,"","",null,null,""]
[null,null,null,null,null,null,null,null,{"$f":"IF(COUNT(I5:I76)=0,\"\",\"Attention, une ou plusieurs APSA du protocole sont mal saisies!\")","v":""},{"$f":"AVERAGE(J5:J71)","v":5}]
[null,"Date de validation par le chef d'établissement :",null,null,null,null,null,null,null,{"$f":"COUNT(J5:J71)","v":2}]
[null,"Informations à transmettre à l'inspection :"]
[]
[null,null,null,null,null,null,null,null,""]
[]
[null,"Partie reservée à l'inspection :"]

{"sheet":"9830298G","index":49,"n_rows":83,"n_cols":10,"rows_kept":83,"cut":false,"hidden":false,"merged":[[64,0,69,0],[64,2,69,2],[70,0,75,0],[70,2,75,2],[28,2,33,2],[52,0,57,0],[52,2,57,2],[58,0,63,0],[58,2,63,2],[40,0,45,0],[40,2,45,2],[46,0,51,0],[46,2,51,2],[2,7,3,7],[4,0,9,0],[4,2,9,2],[10,0,15,0],[10,2,15,2],[16,0,21,0],[16,2,21,2],[2,6,3,6],[0,3,0,5],[2,1,3,1],[2,2,3,2],[2,3,3,3],[2,4,2,5],[34,0,39,0],[34,2,39,2],[22,0,27,0],[22,2,27,2],[28,0,33,0]]}
["R","DNB 2014","9830298G","CLG FRANCIS ROUGE - THIO",null,null,"PROVINCE NORD","Académie de Nouvelle-Calédonie",{"$f":"IF(C1=\"\",\"\",VLOOKUP(C1,etab,4,FALSE))","v":"privé"}]
["GEBEPS_2014_IPR_PROTOCOLES_privé_9830298G.xls",null,null,null,"",null,null,null,{"$f":"Données!M11","v":"V3_29/10/13"}]
[null,"CLASSES            évaluées pour le DNB","NOM \nde l'enseignant responsable de la classe","Activités","Compétences\npropres",null,"dates des évaluations","dates des rattrapages",null,"nbre APSA\n/ classe"]
[null,null,null,null,"CP","Liste"]
["Classe 1","Classe","G.ROY","Aérobic","CP3","N","2014-04-28","2014-05-05",{"$f":"IF(ISERROR(E5),1,\"\")","v":""},{"$f":"IF(COUNTA(D5:D10)<=2,\"\",COUNTA(D5:D10))","v":3}]
[null,"3èA",null,"Javelot","CP1","N","2014-07-21","2014-07-28",{"$f":"IF(ISERROR(E6),1,\"\")","v":""}]
[null,null,null,"Tennis de table","CP4","N","2014-10-27","2014-11-03",""]
[null,"nbre d'élèves :   ",null,null,"","",null,null,""]
[null,14,null,null,"","",null,null,""]
[null,null,null,null,"","",null,null,""]
["Classe 2","Classe",null,null,"","",null,null,"",{"$f":"IF(COUNTA(D11:D16)<=2,\"\",COUNTA(D11:D16))","v":""}]
[null,null,null,null,"","",null,null,""]
[null,null,null,null,"","",null,null,""]
[null,"nbre d'élèves :   ",null,null,"","",null,null,""]
[null,null,null,null,"","",null,null,""]
[null,null,null,null,"","",null,null,""]
["Classe 3","Classe",null,null,"","",null,null,"",{"$f":"IF(COUNTA(D17:D22)<=2,\"\",COUNTA(D17:D22))","v":""}]
[null,null,null,null,"","",null,null,""]
[null,null,null,null,"","",null,null,""]
[null,"nbre d'élèves :   ",null,null,"","",null,null,""]
[null,null,null,null,"","",null,null,""]
[null,null,null,null,"","",null,null,""]
["Classe 4","Classe",null,null,"","",null,null,"",{"$f":"IF(COUNTA(D23:D28)<=2,\"\",COUNTA(D23:D28))","v":""}]
[null,null,null,null,"","",null,null,""]
[null,null,null,null,"","",null,null,""]
[null,"nbre d'élèves :   ",null,null,"","",null,null,""]
[null,null,null,null,"","",null,null,""]
[null,null,null,null,"","",null,null,""]
["Classe 5","Classe",null,null,"","",null,null,"",{"$f":"IF(COUNTA(D29:D34)<=2,\"\",COUNTA(D29:D34))","v":""}]
[null,null,null,null,"","",null,null,""]
[null,null,null,null,"","",null,null,""]
[null,"nbre d'élèves :   ",null,null,"","",null,null,""]
[null,null,null,null,"","",null,null,""]
[null,null,null,null,"","",null,null,""]
["Classe 6","Classe",null,null,"","",null,null,"",{"$f":"IF(COUNTA(D35:D40)<=2,\"\",COUNTA(D35:D40))","v":""}]
[null,null,null,null,"","",null,null,""]
[null,null,null,null,"","",null,null,""]
[null,"nbre d'élèves :   ",null,null,"","",null,null,""]
[null,null,null,null,"","",null,null,""]
[null,null,null,null,"","",null,null,""]
["Classe 7","Classe",null,null,"","",null,null,{"$f":"IF(ISERROR(E41),1,\"\")","v":""},{"$f":"IF(COUNTA(D41:D46)<=2,\"\",COUNTA(D41:D46))","v":""}]
[null,null,null,null,"","",null,null,{"$f":"IF(ISERROR(E42),1,\"\")","v":""}]
[null,null,null,null,"","",null,null,""]
[null,"nbre d'élèves :   ",null,null,"","",null,null,""]
[null,null,null,null,"","",null,null,""]
[null,null,null,null,"","",null,null,""]
["Classe 8","Classe",null,null,"","",null,null,"",{"$f":"IF(COUNTA(D47:D52)<=2,\"\",COUNTA(D47:D52))","v":""}]
[null,null,null,null,"","",null,null,""]
[null,null,null,null,"","",null,null,""]
[null,"nbre d'élèves :   ",null,null,"","",null,null,""]
[null,null,null,null,"","",null,null,""]
[null,null,null,null,"","",null,null,""]
["Classe 9","Classe",null,null,"","",null,null,"",{"$f":"IF(COUNTA(D53:D58)<=2,\"\",COUNTA(D53:D58))","v":""}]
[null,null,null,null,"","",null,null,""]
[null,null,null,null,"","",null,null,""]
[null,"nbre d'élèves :   ",null,null,"","",null,null,""]
[null,null,null,null,"","",null,null,""]
[null,null,null,null,"","",null,null,""]
["Classe 10","Classe",null,null,"","",null,null,"",{"$f":"IF(COUNTA(D59:D64)<=2,\"\",COUNTA(D59:D64))","v":""}]
[null,null,null,null,"","",null,null,""]
[null,null,null,null,"","",null,null,""]
[null,"nbre d'élèves :   ",null,null,"","",null,null,""]
[null,null,null,null,"","",null,null,""]
[null,null,null,null,"","",null,null,""]
["Classe 11","Classe",null,null,"","",null,null,"",{"$f":"IF(COUNTA(D65:D70)<=2,\"\",COUNTA(D65:D70))","v":""}]
[null,null,null,null,"","",null,null,""]
[null,null,null,null,"","",null,null,""]
[null,"nbre d'élèves :   ",null,null,"","",null,null,""]
[null,null,null,null,"","",null,null,""]
[null,null,null,null,"","",null,null,""]
["Classe 12","Classe",null,null,"","",null,null,"",{"$f":"IF(COUNTA(D71:D76)<=2,\"\",COUNTA(D71:D76))","v":""}]
[null,null,null,null,"","",null,null,""]
[null,null,null,null,"","",null,null,""]
[null,"nbre d'élèves :   ",null,null,"","",null,null,""]
[null,null,null,null,"","",null,null,""]
[null,null,null,null,"","",null,null,""]
[null,null,null,null,null,null,null,null,{"$f":"IF(COUNT(I5:I76)=0,\"\",\"Attention, une ou plusieurs APSA du protocole sont mal saisies!\")","v":""},{"$f":"AVERAGE(J5:J71)","v":3}]
[null,"Date de validation par le chef d'établissement :",null,null,"Le 6 juin 2014",null,null,null,null,{"$f":"COUNT(J5:J71)","v":1}]
[null,"Informations à transmettre à l'inspection :"]
[]
[null,null,null,null,null,null,null,null,""]
[]
[null,"Partie reservée à l'inspection :"]

{"sheet":"9830297F","index":50,"n_rows":78,"n_cols":10,"rows_kept":78,"cut":false,"hidden":false,"merged":[[2,7,3,7],[4,0,9,0],[4,2,9,2],[10,0,15,0],[10,2,15,2],[16,0,21,0],[16,2,21,2],[0,3,0,5],[2,1,3,1],[2,2,3,2],[2,3,3,3],[2,4,2,5],[2,6,3,6]]}
["R","DNB 2014","9830297F","CLG HIPPOLYTE BONOU - POUEBO",null,null,"PROVINCE NORD","Académie de Nouvelle-Calédonie",{"$f":"IF(C1=\"\",\"\",VLOOKUP(C1,etab,4,FALSE))","v":"privé"}]
["GEBEPS_2014_IPR_PROTOCOLES_privé_9830297F.xls",null,null,null,"",null,null,null,{"$f":"Données!M11","v":"V3_29/10/13"}]
[null,"CLASSES            évaluées pour le DNB","NOM \nde l'enseignant responsable de la classe","Activités","Compétences\npropres",null,"dates des évaluations","dates des rattrapages",null,"nbre APSA\n/ classe"]
[null,null,null,null,"CP","Liste"]
["Classe 1","Classe","DUMEIGE Stephen","Demi-fond","CP1","N","2014-04-04"," 25/04/14",{"$f":"IF(ISERROR(E5),1,\"\")","v":""},{"$f":"IF(COUNTA(D5:D10)<=2,\"\",COUNTA(D5:D10))","v":3}]
[null,"3A",null,"Acrosport","CP3","N","2014-07-18","2014-07-25",{"$f":"IF(ISERROR(E6),1,\"\")","v":""}]
[null,null,null,"Foot","CP4","N","2014-10-03","2014-10-10",""]
[null,"nbre d'élèves :   ",null,null,"","",null,null,""]
[null,20,null,null,"","",null,null,""]
[null,null,null,null,"","",null,null,""]
["Classe 2","Classe","MOLLO Gildas","Demi-fond","CP1","N","2014-04-29","2014-05-06","",{"$f":"IF(COUNTA(D11:D16)<=2,\"\",COUNTA(D11:D16))","v":3}]
[null,"3B",null,"Acrosport","CP3","N","2014-07-22","2014-07-29",""]
[null,null,null,"Foot","CP4","N","2014-09-30","2014-10-07",""]
[null,"nbre d'élèves :   ",null,null,"","",null,null,""]
[null,20,null,null,"","",null,null,""]
[null,null,null,null,"","",null,null,""]
["Classe 3","Classe","MOLLO Gildas","Demi-fond","CP1","N","2014-04-30","2014-05-07","",{"$f":"IF(COUNTA(D17:D22)<=2,\"\",COUNTA(D17:D22))","v":3}]
[null,"3PDMF",null,"Foot","CP4","N","2014-07-23","2014-07-30",""]
[null,null,null,"Acrosport","CP3","N","2014-10-01","2014-10-08",""]
[null,"nbre d'élèves :   ",null,null,"","",null,null,""]
[null,17,null,null,"","",null,null,""]
[null,null,null,null,"","",null,null,""]
[null,null,null,null,null,null,null,null,"",{"$f":"IF(COUNTA(D23:D28)<=2,\"\",COUNTA(D23:D28))","v":""}]
[null,"Date de validation par le chef d'établissement :",null,null,null,null,null,null,""]
[null,"Informations à transmettre à l'inspection :",null,null,null,null,null,null,""]
[null,null,null,null,null,null,null,null,""]
[null,null,null,null,null,null,null,null,""]
[null,null,null,null,null,null,null,null,""]
[null,"Partie reservée à l'inspection :",null,null,null,null,null,null,"",{"$f":"IF(COUNTA(D29:D34)<=2,\"\",COUNTA(D29:D34))","v":""}]
[null,null,null,null,null,null,null,null,""]
[null,null,null,null,null,null,null,null,""]
[null,null,null,null,null,null,null,null,""]
[null,null,null,null,null,null,null,null,""]
[null,null,null,null,null,null,null,null,""]
[null,null,null,null,null,null,null,null,"",{"$f":"IF(COUNTA(D35:D40)<=2,\"\",COUNTA(D35:D40))","v":""}]
[null,null,null,null,null,null,null,null,""]
[null,null,null,null,null,null,null,null,""]
[null,null,null,null,null,null,null,null,""]
[null,null,null,null,null,null,null,null,""]
[null,null,null,null,null,null,null,null,""]
[null,null,null,null,null,null,null,null,{"$f":"IF(ISERROR(E41),1,\"\")","v":""},{"$f":"IF(COUNTA(D41:D46)<=2,\"\",COUNTA(D41:D46))","v":""}]
[null,null,null,null,null,null,null,null,{"$f":"IF(ISERROR(E42),1,\"\")","v":""}]
[null,null,null,null,null,null,null,null,""]
[null,null,null,null,null,null,null,null,""]
[null,null,null,null,null,null,null,null,""]
[null,null,null,null,null,null,null,null,""]
[null,null,null,null,null,null,null,null,"",{"$f":"IF(COUNTA(D47:D52)<=2,\"\",COUNTA(D47:D52))","v":""}]
[null,null,null,null,null,null,null,null,""]
[null,null,null,null,null,null,null,null,""]
[null,null,null,null,null,null,null,null,""]
[null,null,null,null,null,null,null,null,""]
[null,null,null,null,null,null,null,null,""]
[null,null,null,null,null,null,null,null,"",{"$f":"IF(COUNTA(D53:D58)<=2,\"\",COUNTA(D53:D58))","v":""}]
[null,null,null,null,null,null,null,null,""]
[null,null,null,null,null,null,null,null,""]
[null,null,null,null,null,null,null,null,""]
[null,null,null,null,null,null,null,null,""]
[null,null,null,null,null,null,null,null,""]
[null,null,null,null,null,null,null,null,"",{"$f":"IF(COUNTA(D59:D64)<=2,\"\",COUNTA(D59:D64))","v":""}]
[null,null,null,null,null,null,null,null,""]
[null,null,null,null,null,null,null,null,""]
[null,null,null,null,null,null,null,null,""]
[null,null,null,null,null,null,null,null,""]
[null,null,null,null,null,null,null,null,""]
[null,null,null,null,null,null,null,null,"",{"$f":"IF(COUNTA(D65:D70)<=2,\"\",COUNTA(D65:D70))","v":""}]
[null,null,null,null,null,null,null,null,""]
[null,null,null,null,null,null,null,null,""]
[null,null,null,null,null,null,null,null,""]
[null,null,null,null,null,null,null,null,""]
[null,null,null,null,null,null,null,null,""]
[null,null,null,null,null,null,null,null,"",{"$f":"IF(COUNTA(D71:D76)<=2,\"\",COUNTA(D71:D76))","v":""}]
[null,null,null,null,null,null,null,null,""]
[null,null,null,null,null,null,null,null,""]
[null,null,null,null,null,null,null,null,""]
[null,null,null,null,null,null,null,null,""]
[null,null,null,null,null,null,null,null,""]
[null,null,null,null,null,null,null,null,{"$f":"IF(COUNT(I5:I76)=0,\"\",\"Attention, une ou plusieurs APSA du protocole sont mal saisies!\")","v":""},{"$f":"AVERAGE(J5:J71)","v":3}]
[null,null,null,null,null,null,null,null,null,{"$f":"COUNT(J5:J71)","v":3}]

{"sheet":"9830295D","index":51,"n_rows":83,"n_cols":10,"rows_kept":83,"cut":false,"hidden":false,"merged":[[0,3,0,5],[2,1,3,1],[2,2,3,2],[2,3,3,3],[2,4,2,5],[2,7,3,7],[4,0,9,0],[4,2,9,2],[10,0,15,0],[10,2,15,2],[16,0,21,0],[16,2,21,2],[2,6,3,6],[58,0,63,0],[58,2,63,2],[22,0,27,0],[22,2,27,2],[28,0,33,0],[28,2,33,2],[34,0,39,0],[34,2,39,2],[64,0,69,0],[64,2,69,2],[70,0,75,0],[70,2,75,2],[40,0,45,0],[40,2,45,2],[46,0,51,0],[46,2,51,2],[52,0,57,0],[52,2,57,2]]}
["R","DNB 2014","9830295D","CLG HAVILA - LIFOU",null,null,"PROVINCE DES ILES","Académie de Nouvelle-Calédonie",{"$f":"IF(C1=\"\",\"\",VLOOKUP(C1,etab,4,FALSE))","v":"privé"}]
["GEBEPS_2014_IPR_PROTOCOLES_privé_9830295D.xls",null,null,null,"",null,null,null,{"$f":"Données!M11","v":"V3_29/10/13"}]
[null,"CLASSES            évaluées pour le DNB","NOM \nde l'enseignant responsable de la classe","Activités","Compétences\npropres",null,"dates des évaluations","dates des rattrapages",null,"nbre APSA\n/ classe"]
[null,null,null,null,"CP","Liste"]
["Classe 1","Classe","PAPAZ YVAN","Planche à voile","CP2","A","2014-04-28","2014-05-05",{"$f":"IF(ISERROR(E5),1,\"\")","v":""},{"$f":"IF(COUNTA(D5:D10)<=2,\"\",COUNTA(D5:D10))","v":3}]
[null,"3èA",null,"Relais-vitesse","CP1","N","2014-07-21","2014-07-28",{"$f":"IF(ISERROR(E6),1,\"\")","v":""}]
[null,null,null,"Volley","CP4","N","2014-10-27","2014-11-03",""]
[null,"nbre d'élèves :   ",null,null,"","",null,null,""]
[null,21,null,null,"","",null,null,""]
[null,null,null,null,"","",null,null,""]
["Classe 2","Classe","BOUCHER     SEBASTIEN","Planche à voile","CP2","A","2014-04-28","2014-05-05","",{"$f":"IF(COUNTA(D11:D16)<=2,\"\",COUNTA(D11:D16))","v":3}]
[null,"3èB",null,"Relais-vitesse","CP1","N","2014-07-21","2014-07-28",""]
[null,null,null,"Volley","CP4","N","2014-10-27","2014-11-03",""]
[null,"nbre d'élèves :   ",null,null,"","",null,null,""]
[null,22,null,null,"","",null,null,""]
[null,null,null,null,"","",null,null,""]
["Classe 3","Classe","LAMBERET JOHNNY","Planche à voile","CP2","A","2014-04-04","2014-04-25","",{"$f":"IF(COUNTA(D17:D22)<=2,\"\",COUNTA(D17:D22))","v":3}]
[null,"3èC",null,"Volley","CP4","N","2014-07-25","2014-08-01",""]
[null,null,null,"Relais-vitesse","CP1","N","2014-10-31","2014-11-07",""]
[null,"nbre d'élèves :   ",null,null,"","",null,null,""]
[null,21,null,null,"","",null,null,""]
[null,null,null,null,"","",null,null,""]
["Classe 4","Classe","BOUCHER     SEBASTIEN","Planche à voile","CP2","A","2014-04-22","2014-05-06","",{"$f":"IF(COUNTA(D23:D28)<=2,\"\",COUNTA(D23:D28))","v":3}]
[null,"3èD",null,"Relais-vitesse","CP1","N","2014-07-22","2014-07-29",""]
[null,null,null,"Volley","CP4","N","2014-10-28","2014-11-04",""]
[null,"nbre d'élèves :   ",null,null,"","",null,null,""]
[null,20,null,null,"","",null,null,""]
[null,null,null,null,"","",null,null,""]
["Classe 5","Classe","prof5",null,"","",null,null,"",{"$f":"IF(COUNTA(D29:D34)<=2,\"\",COUNTA(D29:D34))","v":""}]
[null,"3è5",null,null,"","",null,null,""]
[null,null,null,null,"","",null,null,""]
[null,"nbre d'élèves :   ",null,null,"","",null,null,""]
[null,null,null,null,"","",null,null,""]
[null,null,null,null,"","",null,null,""]
["Classe 6","Classe","prof6",null,"","",null,null,"",{"$f":"IF(COUNTA(D35:D40)<=2,\"\",COUNTA(D35:D40))","v":""}]
[null,"3è6",null,null,"","",null,null,""]
[null,null,null,null,"","",null,null,""]
[null,"nbre d'élèves :   ",null,null,"","",null,null,""]
[null,null,null,null,"","",null,null,""]
[null,null,null,null,"","",null,null,""]
["Classe 7","Classe","prof7",null,"","",null,null,{"$f":"IF(ISERROR(E41),1,\"\")","v":""},{"$f":"IF(COUNTA(D41:D46)<=2,\"\",COUNTA(D41:D46))","v":""}]
[null,"3è7",null,null,"","",null,null,{"$f":"IF(ISERROR(E42),1,\"\")","v":""}]
[null,null,null,null,"","",null,null,""]
[null,"nbre d'élèves :   ",null,null,"","",null,null,""]
[null,null,null,null,"","",null,null,""]
[null,null,null,null,"","",null,null,""]
["Classe 8","Classe","prof8",null,"","",null,null,"",{"$f":"IF(COUNTA(D47:D52)<=2,\"\",COUNTA(D47:D52))","v":""}]
[null,"3è8",null,null,"","",null,null,""]
[null,null,null,null,"","",null,null,""]
[null,"nbre d'élèves :   ",null,null,"","",null,null,""]
[null,null,null,null,"","",null,null,""]
[null,null,null,null,"","",null,null,""]
["Classe 9","Classe","prof9",null,"","",null,null,"",{"$f":"IF(COUNTA(D53:D58)<=2,\"\",COUNTA(D53:D58))","v":""}]
[null,"3è9",null,null,"","",null,null,""]
[null,null,null,null,"","",null,null,""]
[null,"nbre d'élèves :   ",null,null,"","",null,null,""]
[null,null,null,null,"","",null,null,""]
[null,null,null,null,"","",null,null,""]
["Classe 10","Classe","prof10",null,"","",null,null,"",{"$f":"IF(COUNTA(D59:D64)<=2,\"\",COUNTA(D59:D64))","v":""}]
[null,"3è10",null,null,"","",null,null,""]
[null,null,null,null,"","",null,null,""]
[null,"nbre d'élèves :   ",null,null,"","",null,null,""]
[null,null,null,null,"","",null,null,""]
[null,null,null,null,"","",null,null,""]
["Classe 11","Classe","prof11",null,"","",null,null,"",{"$f":"IF(COUNTA(D65:D70)<=2,\"\",COUNTA(D65:D70))","v":""}]
[null,"3è11",null,null,"","",null,null,""]
[null,null,null,null,"","",null,null,""]
[null,"nbre d'élèves :   ",null,null,"","",null,null,""]
[null,null,null,null,"","",null,null,""]
[null,null,null,null,"","",null,null,""]
["Classe 12","Classe","prof12",null,"","",null,null,"",{"$f":"IF(COUNTA(D71:D76)<=2,\"\",COUNTA(D71:D76))","v":""}]
[null,"3è12",null,null,"","",null,null,""]
[null,null,null,null,"","",null,null,""]
[null,"nbre d'élèves :   ",null,null,"","",null,null,""]
[null,null,null,null,"","",null,null,""]
[null,null,null,null,"","",null,null,""]
[null,null,null,null,null,null,null,null,{"$f":"IF(COUNT(I5:I76)=0,\"\",\"Attention, une ou plusieurs APSA du protocole sont mal saisies!\")","v":""},{"$f":"AVERAGE(J5:J71)","v":3}]
[null,"Date de validation par le chef d'établissement :",null,null,null,null,null,null,null,{"$f":"COUNT(J5:J71)","v":4}]
[null,"Informations à transmettre à l'inspection :"]
[]
[null,null,null,null,null,null,null,null,""]
[]
[null,"Partie reservée à l'inspection :"]

{"sheet":"9830271C","index":52,"n_rows":83,"n_cols":10,"rows_kept":83,"cut":false,"hidden":false,"merged":[[0,3,0,5],[2,1,3,1],[2,2,3,2],[2,3,3,3],[2,4,2,5],[2,7,3,7],[4,0,9,0],[4,2,9,2],[10,0,15,0],[10,2,15,2],[16,0,21,0],[16,2,21,2],[2,6,3,6],[58,0,63,0],[58,2,63,2],[22,0,27,0],[22,2,27,2],[28,0,33,0],[28,2,33,2],[34,0,39,0],[34,2,39,2],[64,0,69,0],[64,2,69,2],[70,0,75,0],[70,2,75,2],[40,0,45,0],[40,2,45,2],[46,0,51,0],[46,2,51,2],[52,0,57,0],[52,2,57,2]]}
["R","DNB 2014","9830271C","LP CHAMPAGNAT",null,null,"PROVINCE SUD","Académie de Nouvelle-Calédonie",{"$f":"IF(C1=\"\",\"\",VLOOKUP(C1,etab,4,FALSE))","v":"privé"}]
["GEBEPS_2014_IPR_PROTOCOLES_privé_9830271C.xls",null,null,null,"",null,null,null,{"$f":"Données!M11","v":"V3_29/10/13"}]
[null,"CLASSES            évaluées pour le DNB","NOM \nde l'enseignant responsable de la classe","Activités","Compétences\npropres",null,"dates des évaluations","dates des rattrapages",null,"nbre APSA\n/ classe"]
[null,null,null,null,"CP","Liste"]
["Classe 1","Classe","CAROLINE SAO","Natation vitesse","CP1","N","2014-04-03","2014-04-24",{"$f":"IF(ISERROR(E5),1,\"\")","v":""},{"$f":"IF(COUNTA(D5:D10)<=2,\"\",COUNTA(D5:D10))","v":3}]
[null,"3DP",null,"Planche à voile","CP2","A","2014-07-10","2014-07-17",{"$f":"IF(ISERROR(E6),1,\"\")","v":""}]
[null,null,null,"Badminton","CP4","N","2014-10-09","2014-10-30",""]
[null,"nbre d'élèves :   ",null,null,"","",null,null,""]
[null,20,null,null,"","",null,null,""]
[null,null,null,null,"","",null,null,""]
["Classe 2","Classe",null,null,"","",null,null,"",{"$f":"IF(COUNTA(D11:D16)<=2,\"\",COUNTA(D11:D16))","v":""}]
[null,null,null,null,"","",null,null,""]
[null,null,null,null,"","",null,null,""]
[null,"nbre d'élèves :   ",null,null,"","",null,null,""]
[null,null,null,null,"","",null,null,""]
[null,null,null,null,"","",null,null,""]
["Classe 3","Classe",null,null,"","",null,null,"",{"$f":"IF(COUNTA(D17:D22)<=2,\"\",COUNTA(D17:D22))","v":""}]
[null,null,null,null,"","",null,null,""]
[null,null,null,null,"","",null,null,""]
[null,"nbre d'élèves :   ",null,null,"","",null,null,""]
[null,null,null,null,"","",null,null,""]
[null,null,null,null,"","",null,null,""]
["Classe 4","Classe","prof4",null,"","",null,null,"",{"$f":"IF(COUNTA(D23:D28)<=2,\"\",COUNTA(D23:D28))","v":""}]
[null,"3è4",null,null,"","",null,null,""]
[null,null,null,null,"","",null,null,""]
[null,"nbre d'élèves :   ",null,null,"","",null,null,""]
[null,null,null,null,"","",null,null,""]
[null,null,null,null,"","",null,null,""]
["Classe 5","Classe","prof5",null,"","",null,null,"",{"$f":"IF(COUNTA(D29:D34)<=2,\"\",COUNTA(D29:D34))","v":""}]
[null,"3è5",null,null,"","",null,null,""]
[null,null,null,null,"","",null,null,""]
[null,"nbre d'élèves :   ",null,null,"","",null,null,""]
[null,null,null,null,"","",null,null,""]
[null,null,null,null,"","",null,null,""]
["Classe 6","Classe","prof6",null,"","",null,null,"",{"$f":"IF(COUNTA(D35:D40)<=2,\"\",COUNTA(D35:D40))","v":""}]
[null,"3è6",null,null,"","",null,null,""]
[null,null,null,null,"","",null,null,""]
[null,"nbre d'élèves :   ",null,null,"","",null,null,""]
[null,null,null,null,"","",null,null,""]
[null,null,null,null,"","",null,null,""]
["Classe 7","Classe","prof7",null,"","",null,null,{"$f":"IF(ISERROR(E41),1,\"\")","v":""},{"$f":"IF(COUNTA(D41:D46)<=2,\"\",COUNTA(D41:D46))","v":""}]
[null,"3è7",null,null,"","",null,null,{"$f":"IF(ISERROR(E42),1,\"\")","v":""}]
[null,null,null,null,"","",null,null,""]
[null,"nbre d'élèves :   ",null,null,"","",null,null,""]
[null,null,null,null,"","",null,null,""]
[null,null,null,null,"","",null,null,""]
["Classe 8","Classe","prof8",null,"","",null,null,"",{"$f":"IF(COUNTA(D47:D52)<=2,\"\",COUNTA(D47:D52))","v":""}]
[null,"3è8",null,null,"","",null,null,""]
[null,null,null,null,"","",null,null,""]
[null,"nbre d'élèves :   ",null,null,"","",null,null,""]
[null,null,null,null,"","",null,null,""]
[null,null,null,null,"","",null,null,""]
["Classe 9","Classe","prof9",null,"","",null,null,"",{"$f":"IF(COUNTA(D53:D58)<=2,\"\",COUNTA(D53:D58))","v":""}]
[null,"3è9",null,null,"","",null,null,""]
[null,null,null,null,"","",null,null,""]
[null,"nbre d'élèves :   ",null,null,"","",null,null,""]
[null,null,null,null,"","",null,null,""]
[null,null,null,null,"","",null,null,""]
["Classe 10","Classe","prof10",null,"","",null,null,"",{"$f":"IF(COUNTA(D59:D64)<=2,\"\",COUNTA(D59:D64))","v":""}]
[null,"3è10",null,null,"","",null,null,""]
[null,null,null,null,"","",null,null,""]
[null,"nbre d'élèves :   ",null,null,"","",null,null,""]
[null,null,null,null,"","",null,null,""]
[null,null,null,null,"","",null,null,""]
["Classe 11","Classe","prof11",null,"","",null,null,"",{"$f":"IF(COUNTA(D65:D70)<=2,\"\",COUNTA(D65:D70))","v":""}]
[null,"3è11",null,null,"","",null,null,""]
[null,null,null,null,"","",null,null,""]
[null,"nbre d'élèves :   ",null,null,"","",null,null,""]
[null,null,null,null,"","",null,null,""]
[null,null,null,null,"","",null,null,""]
["Classe 12","Classe","prof12",null,"","",null,null,"",{"$f":"IF(COUNTA(D71:D76)<=2,\"\",COUNTA(D71:D76))","v":""}]
[null,"3è12",null,null,"","",null,null,""]
[null,null,null,null,"","",null,null,""]
[null,"nbre d'élèves :   ",null,null,"","",null,null,""]
[null,null,null,null,"","",null,null,""]
[null,null,null,null,"","",null,null,""]
[null,null,null,null,null,null,null,null,{"$f":"IF(COUNT(I5:I76)=0,\"\",\"Attention, une ou plusieurs APSA du protocole sont mal saisies!\")","v":""},{"$f":"AVERAGE(J5:J71)","v":3}]
[null,"Date de validation par le chef d'établissement :",null,null,null,null,null,null,null,{"$f":"COUNT(J5:J71)","v":1}]
[null,"Informations à transmettre à l'inspection :"]
[]
[null,null,null,null,null,null,null,null,""]
[]
[null,"Partie reservée à l'inspection :"]

{"sheet":"9830270B","index":53,"n_rows":83,"n_cols":10,"rows_kept":83,"cut":false,"hidden":false,"merged":[[0,3,0,5],[2,1,3,1],[2,2,3,2],[2,3,3,3],[2,4,2,5],[2,7,3,7],[4,0,9,0],[4,2,9,2],[10,0,15,0],[10,2,15,2],[16,0,21,0],[16,2,21,2],[2,6,3,6],[58,0,63,0],[58,2,63,2],[22,0,27,0],[22,2,27,2],[28,0,33,0],[28,2,33,2],[34,0,39,0],[34,2,39,2],[64,0,69,0],[64,2,69,2],[70,0,75,0],[70,2,75,2],[40,0,45,0],[40,2,45,2],[46,0,51,0],[46,2,51,2],[52,0,57,0],[52,2,57,2]]}
["R","DNB 2014","9830270B","LP JEAN 23",null,null,"PROVINCE SUD","Académie de Nouvelle-Calédonie",{"$f":"IF(C1=\"\",\"\",VLOOKUP(C1,etab,4,FALSE))","v":"privé"}]
["GEBEPS_2014_IPR_PROTOCOLES_privé_9830270B.xls",null,null,null,"",null,null,null,{"$f":"Données!M11","v":"V3_29/10/13"}]
[null,"CLASSES            évaluées pour le DNB","NOM \nde l'enseignant responsable de la classe","Activités","Compétences\npropres",null,"dates des évaluations","dates des rattrapages",null,"nbre APSA\n/ classe"]
[null,null,null,null,"CP","Liste"]
["Classe 1","Classe","VIRATELLE","Acrosport","CP3","N","04/04/201","2014-04-25",{"$f":"IF(ISERROR(E5),1,\"\")","v":""},{"$f":"IF(COUNTA(D5:D10)<=2,\"\",COUNTA(D5:D10))","v":3}]
[null,"3è1",null,"Tennis de table","CP4","N","2014-08-08","2014-08-29",{"$f":"IF(ISERROR(E6),1,\"\")","v":""}]
[null,null,null,"Natation vitesse","CP1","N","2014-10-31","2014-11-07",""]
[null,"nbre d'élèves :   ",null,null,"","",null,null,""]
[null,14,null,null,"","",null,null,""]
[null,null,null,null,"","",null,null,""]
["Classe 2","Classe","prof2",null,"","",null,null,"",{"$f":"IF(COUNTA(D11:D16)<=2,\"\",COUNTA(D11:D16))","v":""}]
[null,"3è2",null,null,"","",null,null,""]
[null,null,null,null,"","",null,null,""]
[null,"nbre d'élèves :   ",null,null,"","",null,null,""]
[null,null,null,null,"","",null,null,""]
[null,null,null,null,"","",null,null,""]
["Classe 3","Classe","prof3",null,"","",null,null,"",{"$f":"IF(COUNTA(D17:D22)<=2,\"\",COUNTA(D17:D22))","v":""}]
[null,"3è3",null,null,"","",null,null,""]
[null,null,null,null,"","",null,null,""]
[null,"nbre d'élèves :   ",null,null,"","",null,null,""]
[null,null,null,null,"","",null,null,""]
[null,null,null,null,"","",null,null,""]
["Classe 4","Classe","prof4",null,"","",null,null,"",{"$f":"IF(COUNTA(D23:D28)<=2,\"\",COUNTA(D23:D28))","v":""}]
[null,"3è4",null,null,"","",null,null,""]
[null,null,null,null,"","",null,null,""]
[null,"nbre d'élèves :   ",null,null,"","",null,null,""]
[null,null,null,null,"","",null,null,""]
[null,null,null,null,"","",null,null,""]
["Classe 5","Classe","prof5",null,"","",null,null,"",{"$f":"IF(COUNTA(D29:D34)<=2,\"\",COUNTA(D29:D34))","v":""}]
[null,"3è5",null,null,"","",null,null,""]
[null,null,null,null,"","",null,null,""]
[null,"nbre d'élèves :   ",null,null,"","",null,null,""]
[null,null,null,null,"","",null,null,""]
[null,null,null,null,"","",null,null,""]
["Classe 6","Classe","prof6",null,"","",null,null,"",{"$f":"IF(COUNTA(D35:D40)<=2,\"\",COUNTA(D35:D40))","v":""}]
[null,"3è6",null,null,"","",null,null,""]
[null,null,null,null,"","",null,null,""]
[null,"nbre d'élèves :   ",null,null,"","",null,null,""]
[null,null,null,null,"","",null,null,""]
[null,null,null,null,"","",null,null,""]
["Classe 7","Classe","prof7",null,"","",null,null,{"$f":"IF(ISERROR(E41),1,\"\")","v":""},{"$f":"IF(COUNTA(D41:D46)<=2,\"\",COUNTA(D41:D46))","v":""}]
[null,"3è7",null,null,"","",null,null,{"$f":"IF(ISERROR(E42),1,\"\")","v":""}]
[null,null,null,null,"","",null,null,""]
[null,"nbre d'élèves :   ",null,null,"","",null,null,""]
[null,null,null,null,"","",null,null,""]
[null,null,null,null,"","",null,null,""]
["Classe 8","Classe","prof8",null,"","",null,null,"",{"$f":"IF(COUNTA(D47:D52)<=2,\"\",COUNTA(D47:D52))","v":""}]
[null,"3è8",null,null,"","",null,null,""]
[null,null,null,null,"","",null,null,""]
[null,"nbre d'élèves :   ",null,null,"","",null,null,""]
[null,null,null,null,"","",null,null,""]
[null,null,null,null,"","",null,null,""]
["Classe 9","Classe","prof9",null,"","",null,null,"",{"$f":"IF(COUNTA(D53:D58)<=2,\"\",COUNTA(D53:D58))","v":""}]
[null,"3è9",null,null,"","",null,null,""]
[null,null,null,null,"","",null,null,""]
[null,"nbre d'élèves :   ",null,null,"","",null,null,""]
[null,null,null,null,"","",null,null,""]
[null,null,null,null,"","",null,null,""]
["Classe 10","Classe","prof10",null,"","",null,null,"",{"$f":"IF(COUNTA(D59:D64)<=2,\"\",COUNTA(D59:D64))","v":""}]
[null,"3è10",null,null,"","",null,null,""]
[null,null,null,null,"","",null,null,""]
[null,"nbre d'élèves :   ",null,null,"","",null,null,""]
[null,null,null,null,"","",null,null,""]
[null,null,null,null,"","",null,null,""]
["Classe 11","Classe","prof11",null,"","",null,null,"",{"$f":"IF(COUNTA(D65:D70)<=2,\"\",COUNTA(D65:D70))","v":""}]
[null,"3è11",null,null,"","",null,null,""]
[null,null,null,null,"","",null,null,""]
[null,"nbre d'élèves :   ",null,null,"","",null,null,""]
[null,null,null,null,"","",null,null,""]
[null,null,null,null,"","",null,null,""]
["Classe 12","Classe","prof12",null,"","",null,null,"",{"$f":"IF(COUNTA(D71:D76)<=2,\"\",COUNTA(D71:D76))","v":""}]
[null,"3è12",null,null,"","",null,null,""]
[null,null,null,null,"","",null,null,""]
[null,"nbre d'élèves :   ",null,null,"","",null,null,""]
[null,null,null,null,"","",null,null,""]
[null,null,null,null,"","",null,null,""]
[null,null,null,null,null,null,null,null,{"$f":"IF(COUNT(I5:I76)=0,\"\",\"Attention, une ou plusieurs APSA du protocole sont mal saisies!\")","v":""},{"$f":"AVERAGE(J5:J71)","v":3}]
[null,"Date de validation par le chef d'établissement :",null,null,null,null,null,null,null,{"$f":"COUNT(J5:J71)","v":1}]
[null,"Informations à transmettre à l'inspection :"]
[]
[null,null,null,null,null,null,null,null,""]
[]
[null,"Partie reservée à l'inspection :"]

{"sheet":"9830267Y","index":54,"n_rows":83,"n_cols":10,"rows_kept":83,"cut":false,"hidden":false,"merged":[[0,3,0,5],[2,1,3,1],[2,2,3,2],[2,3,3,3],[2,4,2,5],[2,7,3,7],[4,0,9,0],[4,2,9,2],[10,0,15,0],[10,2,15,2],[16,0,21,0],[16,2,21,2],[2,6,3,6],[58,0,63,0],[58,2,63,2],[22,0,27,0],[22,2,27,2],[28,0,33,0],[28,2,33,2],[34,0,39,0],[34,2,39,2],[64,0,69,0],[64,2,69,2],[70,0,75,0],[70,2,75,2],[40,0,45,0],[40,2,45,2],[46,0,51,0],[46,2,51,2],[52,0,57,0],[52,2,57,2]]}
["R","DNB 2014","9830267Y","CLG DO NEVA - HOUAILOU",null,null,"PROVINCE NORD","Académie de Nouvelle-Calédonie",{"$f":"IF(C1=\"\",\"\",VLOOKUP(C1,etab,4,FALSE))","v":"privé"}]
["GEBEPS_2014_IPR_PROTOCOLES_privé_9830267Y.xls",null,null,null,"",null,null,null,{"$f":"Données!M11","v":"V3_29/10/13"}]
[null,"CLASSES            évaluées pour le DNB","NOM \nde l'enseignant responsable de la classe","Activités","Compétences\npropres",null,"dates des évaluations","dates des rattrapages",null,"nbre APSA\n/ classe"]
[null,null,null,null,"CP","Liste"]
["Classe 1","Classe","OLIVE","Hauteur","CP1","N","2014-10-31","2014-11-07",{"$f":"IF(ISERROR(E5),1,\"\")","v":""},{"$f":"IF(COUNTA(D5:D10)<=2,\"\",COUNTA(D5:D10))","v":3}]
[null,"3è1",null,"Danse","CP3","N","2014-07-08","2014-07-16",{"$f":"IF(ISERROR(E6),1,\"\")","v":""}]
[null,null,null,"Basket","CP4","N","2014-09-12","2014-09-19",""]
[null,"nbre d'élèves :   ",null,null,"","",null,null,""]
[null,16,null,null,"","",null,null,""]
[null,null,null,null,"","",null,null,""]
["Classe 2","Classe","prof2",null,"","",null,null,"",{"$f":"IF(COUNTA(D11:D16)<=2,\"\",COUNTA(D11:D16))","v":""}]
[null,"3è2",null,null,"","",null,null,""]
[null,null,null,null,"","",null,null,""]
[null,"nbre d'élèves :   ",null,null,"","",null,null,""]
[null,null,null,null,"","",null,null,""]
[null,null,null,null,"","",null,null,""]
["Classe 3","Classe","prof3",null,"","",null,null,"",{"$f":"IF(COUNTA(D17:D22)<=2,\"\",COUNTA(D17:D22))","v":""}]
[null,"3è3",null,null,"","",null,null,""]
[null,null,null,null,"","",null,null,""]
[null,"nbre d'élèves :   ",null,null,"","",null,null,""]
[null,null,null,null,"","",null,null,""]
[null,null,null,null,"","",null,null,""]
["Classe 4","Classe","prof4",null,"","",null,null,"",{"$f":"IF(COUNTA(D23:D28)<=2,\"\",COUNTA(D23:D28))","v":""}]
[null,"3è4",null,null,"","",null,null,""]
[null,null,null,null,"","",null,null,""]
[null,"nbre d'élèves :   ",null,null,"","",null,null,""]
[null,null,null,null,"","",null,null,""]
[null,null,null,null,"","",null,null,""]
["Classe 5","Classe","prof5",null,"","",null,null,"",{"$f":"IF(COUNTA(D29:D34)<=2,\"\",COUNTA(D29:D34))","v":""}]
[null,"3è5",null,null,"","",null,null,""]
[null,null,null,null,"","",null,null,""]
[null,"nbre d'élèves :   ",null,null,"","",null,null,""]
[null,null,null,null,"","",null,null,""]
[null,null,null,null,"","",null,null,""]
["Classe 6","Classe","prof6",null,"","",null,null,"",{"$f":"IF(COUNTA(D35:D40)<=2,\"\",COUNTA(D35:D40))","v":""}]
[null,"3è6",null,null,"","",null,null,""]
[null,null,null,null,"","",null,null,""]
[null,"nbre d'élèves :   ",null,null,"","",null,null,""]
[null,null,null,null,"","",null,null,""]
[null,null,null,null,"","",null,null,""]
["Classe 7","Classe","prof7",null,"","",null,null,{"$f":"IF(ISERROR(E41),1,\"\")","v":""},{"$f":"IF(COUNTA(D41:D46)<=2,\"\",COUNTA(D41:D46))","v":""}]
[null,"3è7",null,null,"","",null,null,{"$f":"IF(ISERROR(E42),1,\"\")","v":""}]
[null,null,null,null,"","",null,null,""]
[null,"nbre d'élèves :   ",null,null,"","",null,null,""]
[null,null,null,null,"","",null,null,""]
[null,null,null,null,"","",null,null,""]
["Classe 8","Classe","prof8",null,"","",null,null,"",{"$f":"IF(COUNTA(D47:D52)<=2,\"\",COUNTA(D47:D52))","v":""}]
[null,"3è8",null,null,"","",null,null,""]
[null,null,null,null,"","",null,null,""]
[null,"nbre d'élèves :   ",null,null,"","",null,null,""]
[null,null,null,null,"","",null,null,""]
[null,null,null,null,"","",null,null,""]
["Classe 9","Classe","prof9",null,"","",null,null,"",{"$f":"IF(COUNTA(D53:D58)<=2,\"\",COUNTA(D53:D58))","v":""}]
[null,"3è9",null,null,"","",null,null,""]
[null,null,null,null,"","",null,null,""]
[null,"nbre d'élèves :   ",null,null,"","",null,null,""]
[null,null,null,null,"","",null,null,""]
[null,null,null,null,"","",null,null,""]
["Classe 10","Classe","prof10",null,"","",null,null,"",{"$f":"IF(COUNTA(D59:D64)<=2,\"\",COUNTA(D59:D64))","v":""}]
[null,"3è10",null,null,"","",null,null,""]
[null,null,null,null,"","",null,null,""]
[null,"nbre d'élèves :   ",null,null,"","",null,null,""]
[null,null,null,null,"","",null,null,""]
[null,null,null,null,"","",null,null,""]
["Classe 11","Classe","prof11",null,"","",null,null,"",{"$f":"IF(COUNTA(D65:D70)<=2,\"\",COUNTA(D65:D70))","v":""}]
[null,"3è11",null,null,"","",null,null,""]
[null,null,null,null,"","",null,null,""]
[null,"nbre d'élèves :   ",null,null,"","",null,null,""]
[null,null,null,null,"","",null,null,""]
[null,null,null,null,"","",null,null,""]
["Classe 12","Classe","prof12",null,"","",null,null,"",{"$f":"IF(COUNTA(D71:D76)<=2,\"\",COUNTA(D71:D76))","v":""}]
[null,"3è12",null,null,"","",null,null,""]
[null,null,null,null,"","",null,null,""]
[null,"nbre d'élèves :   ",null,null,"","",null,null,""]
[null,null,null,null,"","",null,null,""]
[null,null,null,null,"","",null,null,""]
[null,null,null,null,null,null,null,null,{"$f":"IF(COUNT(I5:I76)=0,\"\",\"Attention, une ou plusieurs APSA du protocole sont mal saisies!\")","v":""},{"$f":"AVERAGE(J5:J71)","v":3}]
[null,"Date de validation par le chef d'établissement :",null,null,null,null,null,null,null,{"$f":"COUNT(J5:J71)","v":1}]
[null,"Informations à transmettre à l'inspection :"]
[]
[null,null,null,null,null,null,null,null,""]
[]
[null,"Partie reservée à l'inspection :"]

{"sheet":"9830266X","index":55,"n_rows":83,"n_cols":10,"rows_kept":83,"cut":false,"hidden":false,"merged":[[64,0,69,0],[64,2,69,2],[70,0,75,0],[70,2,75,2],[46,0,51,0],[46,2,51,2],[52,0,57,0],[52,2,57,2],[58,0,63,0],[58,2,63,2],[22,0,27,0],[22,2,27,2],[28,0,33,0],[28,2,33,2],[34,0,39,0],[34,2,39,2],[40,0,45,0],[40,2,45,2],[4,0,9,0],[4,2,9,2],[10,0,15,0],[10,2,15,2],[16,0,21,0],[16,2,21,2],[0,3,0,5],[2,1,3,1],[2,2,3,2],[2,3,3,3],[2,4,2,5],[2,7,3,7],[2,6,3,6]]}
["R","DNB 2014","9830266X","CLG GUILLAUME DOUARRE - OUVEA",null,null,"PROVINCE DES ILES","Académie de Nouvelle-Calédonie",{"$f":"IF(C1=\"\",\"\",VLOOKUP(C1,etab,4,FALSE))","v":"privé"}]
["GEBEPS_2014_IPR_PROTOCOLES_privé_9830266X.xls",null,null,null,"",null,null,null,{"$f":"Données!M11","v":"V3_29/10/13"}]
[null,"CLASSES            évaluées pour le DNB","NOM \nde l'enseignant responsable de la classe","Activités","Compétences\npropres",null,"dates des évaluations","dates des rattrapages",null,"nbre APSA\n/ classe"]
[null,null,null,null,"CP","Liste"]
["Classe 1","Classe","DEVAUX Benoît","Relais-vitesse","CP1","N","28/10 et31/10","4/11 et 7/11",{"$f":"IF(ISERROR(E5),1,\"\")","v":""},{"$f":"IF(COUNTA(D5:D10)<=2,\"\",COUNTA(D5:D10))","v":3}]
[null,"3è1",null,"Volley","CP4","N","22/07 et 25/07","29/07 et 1/08",{"$f":"IF(ISERROR(E6),1,\"\")","v":""}]
[null,null,null,"Voile","CP2","A","22/04 et 1/04","29/04 et 6/05",""]
[null,"nbre d'élèves :   ",null,null,"","",null,null,""]
[null,13,null,null,"","",null,null,""]
[null,null,null,null,"","",null,null,""]
["Classe 2","Classe","POEYDOMENGE Gilles","Relais-vitesse","CP1","N","23/09 et 18/09","2/10 et 9/10","",{"$f":"IF(COUNTA(D11:D16)<=2,\"\",COUNTA(D11:D16))","v":5}]
[null,"3è2",null,"Volley","CP4","N","25/03 et 1/04","29/04 et 23/04",""]
[null,null,null,"Badminton","CP4","N","16/09 et 25/09","30/09 et 7/10",""]
[null,"nbre d'élèves :   ",null,"Voile","CP2","A","3/06 et 24/06","1/07 et 08/07",""]
[null,12,null,"Danse","CP3","N","27/03 et 3/04","24/04 et 29/04",""]
[null,null,null,null,"","",null,null,""]
["Classe 3","Classe","prof3",null,"","",null,null,"",{"$f":"IF(COUNTA(D17:D22)<=2,\"\",COUNTA(D17:D22))","v":""}]
[null,"3è3",null,null,"","",null,null,""]
[null,null,null,null,"","",null,null,""]
[null,"nbre d'élèves :   ",null,null,"","",null,null,""]
[null,null,null,null,"","",null,null,""]
[null,null,null,null,"","",null,null,""]
["Classe 4","Classe","prof4",null,"","",null,null,"",{"$f":"IF(COUNTA(D23:D28)<=2,\"\",COUNTA(D23:D28))","v":""}]
[null,"3è4",null,null,"","",null,null,""]
[null,null,null,null,"","",null,null,""]
[null,"nbre d'élèves :   ",null,null,"","",null,null,""]
[null,null,null,null,"","",null,null,""]
[null,null,null,null,"","",null,null,""]
["Classe 5","Classe","prof5",null,"","",null,null,"",{"$f":"IF(COUNTA(D29:D34)<=2,\"\",COUNTA(D29:D34))","v":""}]
[null,"3è5",null,null,"","",null,null,""]
[null,null,null,null,"","",null,null,""]
[null,"nbre d'élèves :   ",null,null,"","",null,null,""]
[null,null,null,null,"","",null,null,""]
[null,null,null,null,"","",null,null,""]
["Classe 6","Classe","prof6",null,"","",null,null,"",{"$f":"IF(COUNTA(D35:D40)<=2,\"\",COUNTA(D35:D40))","v":""}]
[null,"3è6",null,null,"","",null,null,""]
[null,null,null,null,"","",null,null,""]
[null,"nbre d'élèves :   ",null,null,"","",null,null,""]
[null,null,null,null,"","",null,null,""]
[null,null,null,null,"","",null,null,""]
["Classe 7","Classe","prof7",null,"","",null,null,{"$f":"IF(ISERROR(E41),1,\"\")","v":""},{"$f":"IF(COUNTA(D41:D46)<=2,\"\",COUNTA(D41:D46))","v":""}]
[null,"3è7",null,null,"","",null,null,{"$f":"IF(ISERROR(E42),1,\"\")","v":""}]
[null,null,null,null,"","",null,null,""]
[null,"nbre d'élèves :   ",null,null,"","",null,null,""]
[null,null,null,null,"","",null,null,""]
[null,null,null,null,"","",null,null,""]
["Classe 8","Classe","prof8",null,"","",null,null,"",{"$f":"IF(COUNTA(D47:D52)<=2,\"\",COUNTA(D47:D52))","v":""}]
[null,"3è8",null,null,"","",null,null,""]
[null,null,null,null,"","",null,null,""]
[null,"nbre d'élèves :   ",null,null,"","",null,null,""]
[null,null,null,null,"","",null,null,""]
[null,null,null,null,"","",null,null,""]
["Classe 9","Classe","prof9",null,"","",null,null,"",{"$f":"IF(COUNTA(D53:D58)<=2,\"\",COUNTA(D53:D58))","v":""}]
[null,"3è9",null,null,"","",null,null,""]
[null,null,null,null,"","",null,null,""]
[null,"nbre d'élèves :   ",null,null,"","",null,null,""]
[null,null,null,null,"","",null,null,""]
[null,null,null,null,"","",null,null,""]
["Classe 10","Classe","prof10",null,"","",null,null,"",{"$f":"IF(COUNTA(D59:D64)<=2,\"\",COUNTA(D59:D64))","v":""}]
[null,"3è10",null,null,"","",null,null,""]
[null,null,null,null,"","",null,null,""]
[null,"nbre d'élèves :   ",null,null,"","",null,null,""]
[null,null,null,null,"","",null,null,""]
[null,null,null,null,"","",null,null,""]
["Classe 11","Classe","prof11",null,"","",null,null,"",{"$f":"IF(COUNTA(D65:D70)<=2,\"\",COUNTA(D65:D70))","v":""}]
[null,"3è11",null,null,"","",null,null,""]
[null,null,null,null,"","",null,null,""]
[null,"nbre d'élèves :   ",null,null,"","",null,null,""]
[null,null,null,null,"","",null,null,""]
[null,null,null,null,"","",null,null,""]
["Classe 12","Classe","prof12",null,"","",null,null,"",{"$f":"IF(COUNTA(D71:D76)<=2,\"\",COUNTA(D71:D76))","v":""}]
[null,"3è12",null,null,"","",null,null,""]
[null,null,null,null,"","",null,null,""]
[null,"nbre d'élèves :   ",null,null,"","",null,null,""]
[null,null,null,null,"","",null,null,""]
[null,null,null,null,"","",null,null,""]
[null,null,null,null,null,null,null,null,{"$f":"IF(COUNT(I5:I76)=0,\"\",\"Attention, une ou plusieurs APSA du protocole sont mal saisies!\")","v":""},{"$f":"AVERAGE(J5:J71)","v":4}]
[null,"Date de validation par le chef d'établissement :",null,null,null,null,null,null,null,{"$f":"COUNT(J5:J71)","v":2}]
[null,"Informations à transmettre à l'inspection :"]
[]
[null,null,null,null,null,null,null,null,""]
[]
[null,"Partie reservée à l'inspection :"]

{"sheet":"9830265W","index":56,"n_rows":83,"n_cols":10,"rows_kept":83,"cut":false,"hidden":false,"merged":[[22,0,27,0],[22,2,27,2],[2,7,3,7],[2,6,3,6],[0,3,0,5],[2,1,3,1],[2,2,3,2],[2,3,3,3],[2,4,2,5],[52,0,57,0],[52,2,57,2],[34,0,39,0],[34,2,39,2],[4,0,9,0],[4,2,9,2],[10,0,15,0],[10,2,15,2],[16,0,21,0],[16,2,21,2],[40,0,45,0],[40,2,45,2],[46,0,51,0],[46,2,51,2],[28,0,33,0],[28,2,33,2],[64,0,69,0],[64,2,69,2],[70,0,75,0],[70,2,75,2],[58,0,63,0],[58,2,63,2]]}
["R","DNB 2014","9830265W","CLG SACRE CŒUR - BOURAIL",null,null,"PROVINCE SUD","Académie de Nouvelle-Calédonie",{"$f":"IF(C1=\"\",\"\",VLOOKUP(C1,etab,4,FALSE))","v":"privé"}]
["GEBEPS_2014_IPR_PROTOCOLES_privé_9830265W.xls",null,null,null,"",null,null,null,{"$f":"Données!M11","v":"V3_29/10/13"}]
[null,"CLASSES            évaluées pour le DNB","NOM \nde l'enseignant responsable de la classe","Activités","Compétences\npropres",null,"dates des évaluations","dates des rattrapages",null,"nbre APSA\n/ classe"]
[null,null,null,null,"CP","Liste"]
["Classe 1","Classe","DUVERGE","Danse","CP3","N","2014-04-04","2014-04-25",{"$f":"IF(ISERROR(E5),1,\"\")","v":""},{"$f":"IF(COUNTA(D5:D10)<=2,\"\",COUNTA(D5:D10))","v":3}]
[null,"3èA",null,"Javelot","CP1","N","2014-07-21","2014-07-25",{"$f":"IF(ISERROR(E6),1,\"\")","v":""}]
[null,null,null,"Badminton","CP4","N","2014-09-26","2014-09-29",""]
[null,"nbre d'élèves :   ",null,null,"","",null,null,""]
[null,20,null,null,"","",null,null,""]
[null,null,null,null,"","",null,null,""]
["Classe 2","Classe","DURAND","Javelot","CP1","N","2014-04-01","2014-04-04","",{"$f":"IF(COUNTA(D11:D16)<=2,\"\",COUNTA(D11:D16))","v":3}]
[null,"3èB",null,"Danse","CP3","N","2014-07-11","2014-07-18",""]
[null,null,null,"Foot","CP4","N","2014-08-19","2014-09-26",""]
[null,"nbre d'élèves :   ",null,null,"","",null,null,""]
[null,21,null,null,"","",null,null,""]
[null,null,null,null,"","",null,null,""]
["Classe 3","Classe","BERT","Lutte","CP4","N","2014-04-25","2014-06-06","",{"$f":"IF(COUNTA(D17:D22)<=2,\"\",COUNTA(D17:D22))","v":3}]
[null,"3èC",null,"Relais-vitesse","CP1","N","2014-07-25","2014-07-29",""]
[null,null,null,"Acrosport","CP3","N","2014-10-10","2014-10-31",""]
[null,"nbre d'élèves :   ",null,null,"","",null,null,""]
[null,22,null,null,"","",null,null,""]
[null,null,null,null,"","",null,null,""]
["Classe 4","Classe","prof4",null,"","",null,null,"",{"$f":"IF(COUNTA(D23:D28)<=2,\"\",COUNTA(D23:D28))","v":""}]
[null,"3è4",null,null,"","",null,null,""]
[null,null,null,null,"","",null,null,""]
[null,"nbre d'élèves :   ",null,null,"","",null,null,""]
[null,null,null,null,"","",null,null,""]
[null,null,null,null,"","",null,null,""]
["Classe 5","Classe","prof5",null,"","",null,null,"",{"$f":"IF(COUNTA(D29:D34)<=2,\"\",COUNTA(D29:D34))","v":""}]
[null,"3è5",null,null,"","",null,null,""]
[null,null,null,null,"","",null,null,""]
[null,"nbre d'élèves :   ",null,null,"","",null,null,""]
[null,null,null,null,"","",null,null,""]
[null,null,null,null,"","",null,null,""]
["Classe 6","Classe","prof6",null,"","",null,null,"",{"$f":"IF(COUNTA(D35:D40)<=2,\"\",COUNTA(D35:D40))","v":""}]
[null,"3è6",null,null,"","",null,null,""]
[null,null,null,null,"","",null,null,""]
[null,"nbre d'élèves :   ",null,null,"","",null,null,""]
[null,null,null,null,"","",null,null,""]
[null,null,null,null,"","",null,null,""]
["Classe 7","Classe","prof7",null,"","",null,null,{"$f":"IF(ISERROR(E41),1,\"\")","v":""},{"$f":"IF(COUNTA(D41:D46)<=2,\"\",COUNTA(D41:D46))","v":""}]
[null,"3è7",null,null,"","",null,null,{"$f":"IF(ISERROR(E42),1,\"\")","v":""}]
[null,null,null,null,"","",null,null,""]
[null,"nbre d'élèves :   ",null,null,"","",null,null,""]
[null,null,null,null,"","",null,null,""]
[null,null,null,null,"","",null,null,""]
["Classe 8","Classe","prof8",null,"","",null,null,"",{"$f":"IF(COUNTA(D47:D52)<=2,\"\",COUNTA(D47:D52))","v":""}]
[null,"3è8",null,null,"","",null,null,""]
[null,null,null,null,"","",null,null,""]
[null,"nbre d'élèves :   ",null,null,"","",null,null,""]
[null,null,null,null,"","",null,null,""]
[null,null,null,null,"","",null,null,""]
["Classe 9","Classe","prof9",null,"","",null,null,"",{"$f":"IF(COUNTA(D53:D58)<=2,\"\",COUNTA(D53:D58))","v":""}]
[null,"3è9",null,null,"","",null,null,""]
[null,null,null,null,"","",null,null,""]
[null,"nbre d'élèves :   ",null,null,"","",null,null,""]
[null,null,null,null,"","",null,null,""]
[null,null,null,null,"","",null,null,""]
["Classe 10","Classe","prof10",null,"","",null,null,"",{"$f":"IF(COUNTA(D59:D64)<=2,\"\",COUNTA(D59:D64))","v":""}]
[null,"3è10",null,null,"","",null,null,""]
[null,null,null,null,"","",null,null,""]
[null,"nbre d'élèves :   ",null,null,"","",null,null,""]
[null,null,null,null,"","",null,null,""]
[null,null,null,null,"","",null,null,""]
["Classe 11","Classe","prof11",null,"","",null,null,"",{"$f":"IF(COUNTA(D65:D70)<=2,\"\",COUNTA(D65:D70))","v":""}]
[null,"3è11",null,null,"","",null,null,""]
[null,null,null,null,"","",null,null,""]
[null,"nbre d'élèves :   ",null,null,"","",null,null,""]
[null,null,null,null,"","",null,null,""]
[null,null,null,null,"","",null,null,""]
["Classe 12","Classe","prof12",null,"","",null,null,"",{"$f":"IF(COUNTA(D71:D76)<=2,\"\",COUNTA(D71:D76))","v":""}]
[null,"3è12",null,null,"","",null,null,""]
[null,null,null,null,"","",null,null,""]
[null,"nbre d'élèves :   ",null,null,"","",null,null,""]
[null,null,null,null,"","",null,null,""]
[null,null,null,null,"","",null,null,""]
[null,null,null,null,null,null,null,null,{"$f":"IF(COUNT(I5:I76)=0,\"\",\"Attention, une ou plusieurs APSA du protocole sont mal saisies!\")","v":""},{"$f":"AVERAGE(J5:J71)","v":3}]
[null,"Date de validation par le chef d'établissement :",null,null,"2014-03-29",null,null,null,null,{"$f":"COUNT(J5:J71)","v":3}]
[null,"Informations à transmettre à l'inspection :"]
[]
[null,null,null,null,null,null,null,null,""]
[]
[null,"Partie reservée à l'inspection :"]

{"sheet":"9830264V","index":57,"n_rows":83,"n_cols":10,"rows_kept":83,"cut":false,"hidden":false,"merged":[[0,3,0,5],[2,1,3,1],[2,2,3,2],[2,3,3,3],[2,4,2,5],[2,7,3,7],[4,0,9,0],[4,2,9,2],[10,0,15,0],[10,2,15,2],[16,0,21,0],[16,2,21,2],[2,6,3,6],[58,0,63,0],[58,2,63,2],[22,0,27,0],[22,2,27,2],[28,0,33,0],[28,2,33,2],[34,0,39,0],[34,2,39,2],[64,0,69,0],[64,2,69,2],[70,0,75,0],[70,2,75,2],[40,0,45,0],[40,2,45,2],[46,0,51,0],[46,2,51,2],[52,0,57,0],[52,2,57,2]]}
["R","DNB 2014","9830264V","CLG SAINTE MARIE - PAITA",null,null,"PROVINCE SUD","Académie de Nouvelle-Calédonie",{"$f":"IF(C1=\"\",\"\",VLOOKUP(C1,etab,4,FALSE))","v":"privé"}]
["GEBEPS_2014_IPR_PROTOCOLES_privé_9830264V.xls",null,null,null,"",null,null,null,{"$f":"Données!M11","v":"V3_29/10/13"}]
[null,"CLASSES            évaluées pour le DNB","NOM \nde l'enseignant responsable de la classe","Activités","Compétences\npropres",null,"dates des évaluations","dates des rattrapages",null,"nbre APSA\n/ classe"]
[null,null,null,null,"CP","Liste"]
["Classe 1","Classe","ADAMUS P.","CO","CP2","N","2014-04-04","2014-04-25",{"$f":"IF(ISERROR(E5),1,\"\")","v":""},{"$f":"IF(COUNTA(D5:D10)<=2,\"\",COUNTA(D5:D10))","v":3}]
[null,"3èA",null,"Volley","CP4","N","2014-07-25","2014-08-01",{"$f":"IF(ISERROR(E6),1,\"\")","v":""}]
[null,null,null,"Haies","CP1","N","2014-10-31","2014-11-07",""]
[null,"nbre d'élèves :   ",null,null,"","",null,null,""]
[null,22,null,null,"","",null,null,""]
[null,null,null,null,"","",null,null,""]
["Classe 2","Classe","ADAMUS P.","Volley","CP4","N","2014-04-28","2014-05-05","",{"$f":"IF(COUNTA(D11:D16)<=2,\"\",COUNTA(D11:D16))","v":3}]
[null,"3èB",null,"CO","CP2","N","2014-07-21","2014-07-28",""]
[null,29,null,"Haies","CP1","N","2014-10-27","2014-11-03",""]
[null,"nbre d'élèves :   ",null,null,"","",null,null,""]
[null,null,null,null,"","",null,null,""]
[null,null,null,null,"","",null,null,""]
["Classe 3","Classe","DECASTILLE J.","Basket","CP4","N","2014-04-28","2014-05-05","",{"$f":"IF(COUNTA(D17:D22)<=2,\"\",COUNTA(D17:D22))","v":3}]
[null,"3èC",null,"Voile","CP2","A","2014-07-21","2014-07-28",""]
[null,null,null,"Haies","CP1","N","2014-10-27","2014-11-03",""]
[null,"nbre d'élèves :   ",null,null,"","",null,null,""]
[null,null,null,null,"","",null,null,""]
[null,null,null,null,"","",null,null,""]
["Classe 4","Classe","NENERT P.","Haies","CP1","N","2014-04-29","2014-05-06","",{"$f":"IF(COUNTA(D23:D28)<=2,\"\",COUNTA(D23:D28))","v":3}]
[null,"3èD",null,"Volley","CP4","N","2014-07-22","2014-07-29",""]
[null,null,null,"Planche à voile","CP2","A","2014-10-28","2014-11-04",""]
[null,"nbre d'élèves :   ",null,null,"","",null,null,""]
[null,null,null,null,"","",null,null,""]
[null,null,null,null,"","",null,null,""]
["Classe 5","Classe","NENERT P.","Foot","CP4","N","2014-04-28","2014-05-05","",{"$f":"IF(COUNTA(D29:D34)<=2,\"\",COUNTA(D29:D34))","v":3}]
[null,"3èDP6",null,"Planche à voile","CP2","A","2014-07-21","2014-07-28",""]
[null,null,null,"Haies","CP1","N","2014-10-27","2014-11-03",""]
[null,"nbre d'élèves :   ",null,null,"","",null,null,""]
[null,null,null,null,"","",null,null,""]
[null,null,null,null,"","",null,null,""]
["Classe 6","Classe",null,null,"","",null,null,"",{"$f":"IF(COUNTA(D35:D40)<=2,\"\",COUNTA(D35:D40))","v":""}]
[null,null,null,null,"","",null,null,""]
[null,null,null,null,"","",null,null,""]
[null,"nbre d'élèves :   ",null,null,"","",null,null,""]
[null,null,null,null,"","",null,null,""]
[null,null,null,null,"","",null,null,""]
["Classe 7","Classe",null,null,"","",null,null,{"$f":"IF(ISERROR(E41),1,\"\")","v":""},{"$f":"IF(COUNTA(D41:D46)<=2,\"\",COUNTA(D41:D46))","v":""}]
[null,null,null,null,"","",null,null,{"$f":"IF(ISERROR(E42),1,\"\")","v":""}]
[null,null,null,null,"","",null,null,""]
[null,"nbre d'élèves :   ",null,null,"","",null,null,""]
[null,null,null,null,"","",null,null,""]
[null,null,null,null,"","",null,null,""]
["Classe 8","Classe",null,null,"","",null,null,"",{"$f":"IF(COUNTA(D47:D52)<=2,\"\",COUNTA(D47:D52))","v":""}]
[null,null,null,null,"","",null,null,""]
[null,null,null,null,"","",null,null,""]
[null,"nbre d'élèves :   ",null,null,"","",null,null,""]
[null,null,null,null,"","",null,null,""]
[null,null,null,null,"","",null,null,""]
["Classe 9","Classe",null,null,"","",null,null,"",{"$f":"IF(COUNTA(D53:D58)<=2,\"\",COUNTA(D53:D58))","v":""}]
[null,null,null,null,"","",null,null,""]
[null,null,null,null,"","",null,null,""]
[null,"nbre d'élèves :   ",null,null,"","",null,null,""]
[null,null,null,null,"","",null,null,""]
[null,null,null,null,"","",null,null,""]
["Classe 10","Classe",null,null,"","",null,null,"",{"$f":"IF(COUNTA(D59:D64)<=2,\"\",COUNTA(D59:D64))","v":""}]
[null,null,null,null,"","",null,null,""]
[null,null,null,null,"","",null,null,""]
[null,"nbre d'élèves :   ",null,null,"","",null,null,""]
[null,null,null,null,"","",null,null,""]
[null,null,null,null,"","",null,null,""]
["Classe 11","Classe",null,null,"","",null,null,"",{"$f":"IF(COUNTA(D65:D70)<=2,\"\",COUNTA(D65:D70))","v":""}]
[null,null,null,null,"","",null,null,""]
[null,null,null,null,"","",null,null,""]
[null,"nbre d'élèves :   ",null,null,"","",null,null,""]
[null,null,null,null,"","",null,null,""]
[null,null,null,null,"","",null,null,""]
["Classe 12","Classe",null,null,"","",null,null,"",{"$f":"IF(COUNTA(D71:D76)<=2,\"\",COUNTA(D71:D76))","v":""}]
[null,null,null,null,"","",null,null,""]
[null,null,null,null,"","",null,null,""]
[null,"nbre d'élèves :   ",null,null,"","",null,null,""]
[null,null,null,null,"","",null,null,""]
[null,null,null,null,"","",null,null,""]
[null,null,null,null,null,null,null,null,{"$f":"IF(COUNT(I5:I76)=0,\"\",\"Attention, une ou plusieurs APSA du protocole sont mal saisies!\")","v":""},{"$f":"AVERAGE(J5:J71)","v":3}]
[null,"Date de validation par le chef d'établissement :",null,null,null,null,"2014-05-28",null,null,{"$f":"COUNT(J5:J71)","v":5}]
[null,"Informations à transmettre à l'inspection :"]
[]
[null,null,null,null,null,null,null,null,""]
[]
[null,"Partie reservée à l'inspection :"]

{"sheet":"9830263U","index":58,"n_rows":83,"n_cols":10,"rows_kept":83,"cut":false,"hidden":false,"merged":[[0,3,0,5],[2,1,3,1],[2,2,3,2],[2,3,3,3],[2,4,2,5],[2,7,3,7],[4,0,9,0],[4,2,9,2],[10,0,15,0],[10,2,15,2],[16,0,21,0],[16,2,21,2],[2,6,3,6],[58,0,63,0],[58,2,63,2],[22,0,27,0],[22,2,27,2],[28,0,33,0],[28,2,33,2],[34,0,39,0],[34,2,39,2],[64,0,69,0],[64,2,69,2],[70,0,75,0],[70,2,75,2],[40,0,45,0],[40,2,45,2],[46,0,51,0],[46,2,51,2],[52,0,57,0],[52,2,57,2]]}
["R","DNB 2014","9830263U","CLG MARIE REINE THABOR - MONT DORE",null,null,"PROVINCE SUD","Académie de Nouvelle-Calédonie",{"$f":"IF(C1=\"\",\"\",VLOOKUP(C1,etab,4,FALSE))","v":"privé"}]
["GEBEPS_2014_IPR_PROTOCOLES_privé_9830263U.xls",null,null,null,"",null,null,null,{"$f":"Données!M11","v":"V3_29/10/13"}]
[null,"CLASSES            évaluées pour le DNB","NOM \nde l'enseignant responsable de la classe","Activités","Compétences\npropres",null,"dates des évaluations","dates des rattrapages",null,"nbre APSA\n/ classe"]
[null,null,null,null,"CP","Liste"]
["Classe 1","Classe","Duvin","Badminton","CP4","N","2014-04-03","2014-04-24",{"$f":"IF(ISERROR(E5),1,\"\")","v":""},{"$f":"IF(COUNTA(D5:D10)<=2,\"\",COUNTA(D5:D10))","v":4}]
[null,"3èA",null,"Hand","CP4","N","2014-06-25","2014-07-01",{"$f":"IF(ISERROR(E6),1,\"\")","v":""}]
[null,null,null,"Relais-vitesse","CP1","N","2014-10-31","2014-11-06",""]
[null,"nbre d'élèves :   ",null,"Gymnastique sportive","CP3","N","2014-07-24","2014-07-31",""]
[null,16,null,null,"","",null,null,""]
[null,null,null,null,"","",null,null,""]
["Classe 2","Classe","prof2",null,"","",null,null,"",{"$f":"IF(COUNTA(D11:D16)<=2,\"\",COUNTA(D11:D16))","v":""}]
[null,"3è2",null,null,"","",null,null,""]
[null,null,null,null,"","",null,null,""]
[null,"nbre d'élèves :   ",null,null,"","",null,null,""]
[null,null,null,null,"","",null,null,""]
[null,null,null,null,"","",null,null,""]
["Classe 3","Classe","prof3",null,"","",null,null,"",{"$f":"IF(COUNTA(D17:D22)<=2,\"\",COUNTA(D17:D22))","v":""}]
[null,"3è3",null,null,"","",null,null,""]
[null,null,null,null,"","",null,null,""]
[null,"nbre d'élèves :   ",null,null,"","",null,null,""]
[null,null,null,null,"","",null,null,""]
[null,null,null,null,"","",null,null,""]
["Classe 4","Classe","prof4",null,"","",null,null,"",{"$f":"IF(COUNTA(D23:D28)<=2,\"\",COUNTA(D23:D28))","v":""}]
[null,"3è4",null,null,"","",null,null,""]
[null,null,null,null,"","",null,null,""]
[null,"nbre d'élèves :   ",null,null,"","",null,null,""]
[null,null,null,null,"","",null,null,""]
[null,null,null,null,"","",null,null,""]
["Classe 5","Classe","prof5",null,"","",null,null,"",{"$f":"IF(COUNTA(D29:D34)<=2,\"\",COUNTA(D29:D34))","v":""}]
[null,"3è5",null,null,"","",null,null,""]
[null,null,null,null,"","",null,null,""]
[null,"nbre d'élèves :   ",null,null,"","",null,null,""]
[null,null,null,null,"","",null,null,""]
[null,null,null,null,"","",null,null,""]
["Classe 6","Classe","prof6",null,"","",null,null,"",{"$f":"IF(COUNTA(D35:D40)<=2,\"\",COUNTA(D35:D40))","v":""}]
[null,"3è6",null,null,"","",null,null,""]
[null,null,null,null,"","",null,null,""]
[null,"nbre d'élèves :   ",null,null,"","",null,null,""]
[null,null,null,null,"","",null,null,""]
[null,null,null,null,"","",null,null,""]
["Classe 7","Classe","prof7",null,"","",null,null,{"$f":"IF(ISERROR(E41),1,\"\")","v":""},{"$f":"IF(COUNTA(D41:D46)<=2,\"\",COUNTA(D41:D46))","v":""}]
[null,"3è7",null,null,"","",null,null,{"$f":"IF(ISERROR(E42),1,\"\")","v":""}]
[null,null,null,null,"","",null,null,""]
[null,"nbre d'élèves :   ",null,null,"","",null,null,""]
[null,null,null,null,"","",null,null,""]
[null,null,null,null,"","",null,null,""]
["Classe 8","Classe","prof8",null,"","",null,null,"",{"$f":"IF(COUNTA(D47:D52)<=2,\"\",COUNTA(D47:D52))","v":""}]
[null,"3è8",null,null,"","",null,null,""]
[null,null,null,null,"","",null,null,""]
[null,"nbre d'élèves :   ",null,null,"","",null,null,""]
[null,null,null,null,"","",null,null,""]
[null,null,null,null,"","",null,null,""]
["Classe 9","Classe","prof9",null,"","",null,null,"",{"$f":"IF(COUNTA(D53:D58)<=2,\"\",COUNTA(D53:D58))","v":""}]
[null,"3è9",null,null,"","",null,null,""]
[null,null,null,null,"","",null,null,""]
[null,"nbre d'élèves :   ",null,null,"","",null,null,""]
[null,null,null,null,"","",null,null,""]
[null,null,null,null,"","",null,null,""]
["Classe 10","Classe","prof10",null,"","",null,null,"",{"$f":"IF(COUNTA(D59:D64)<=2,\"\",COUNTA(D59:D64))","v":""}]
[null,"3è10",null,null,"","",null,null,""]
[null,null,null,null,"","",null,null,""]
[null,"nbre d'élèves :   ",null,null,"","",null,null,""]
[null,null,null,null,"","",null,null,""]
[null,null,null,null,"","",null,null,""]
["Classe 11","Classe","prof11",null,"","",null,null,"",{"$f":"IF(COUNTA(D65:D70)<=2,\"\",COUNTA(D65:D70))","v":""}]
[null,"3è11",null,null,"","",null,null,""]
[null,null,null,null,"","",null,null,""]
[null,"nbre d'élèves :   ",null,null,"","",null,null,""]
[null,null,null,null,"","",null,null,""]
[null,null,null,null,"","",null,null,""]
["Classe 12","Classe","prof12",null,"","",null,null,"",{"$f":"IF(COUNTA(D71:D76)<=2,\"\",COUNTA(D71:D76))","v":""}]
[null,"3è12",null,null,"","",null,null,""]
[null,null,null,null,"","",null,null,""]
[null,"nbre d'élèves :   ",null,null,"","",null,null,""]
[null,null,null,null,"","",null,null,""]
[null,null,null,null,"","",null,null,""]
[null,null,null,null,null,null,null,null,{"$f":"IF(COUNT(I5:I76)=0,\"\",\"Attention, une ou plusieurs APSA du protocole sont mal saisies!\")","v":""},{"$f":"AVERAGE(J5:J71)","v":4}]
[null,"Date de validation par le chef d'établissement :",null,null,null,null,null,null,null,{"$f":"COUNT(J5:J71)","v":1}]
[null,"Informations à transmettre à l'inspection :"]
[]
[null,null,null,null,null,null,null,null,""]
[]
[null,"Partie reservée à l'inspection :"]

{"sheet":"9830260R","index":59,"n_rows":83,"n_cols":10,"rows_kept":83,"cut":false,"hidden":false,"merged":[[0,3,0,5],[2,1,3,1],[2,2,3,2],[2,3,3,3],[2,4,2,5],[2,7,3,7],[4,0,9,0],[4,2,9,2],[10,0,15,0],[10,2,15,2],[16,0,21,0],[16,2,21,2],[2,6,3,6],[58,0,63,0],[58,2,63,2],[22,0,27,0],[22,2,27,2],[28,0,33,0],[28,2,33,2],[34,0,39,0],[34,2,39,2],[64,0,69,0],[64,2,69,2],[70,0,75,0],[70,2,75,2],[40,0,45,0],[40,2,45,2],[46,0,51,0],[46,2,51,2],[52,0,57,0],[52,2,57,2]]}
["R","DNB 2014","9830260R","CLG SAINT JOSEPH DE CLUNY - NOUMEA",null,null,"PROVINCE SUD","Académie de Nouvelle-Calédonie",{"$f":"IF(C1=\"\",\"\",VLOOKUP(C1,etab,4,FALSE))","v":"privé"}]
["GEBEPS_2014_IPR_PROTOCOLES_privé_9830260R.xls",null,null,null,"",null,null,null,{"$f":"Données!M11","v":"V3_29/10/13"}]
[null,"CLASSES            évaluées pour le DNB","NOM \nde l'enseignant responsable de la classe","Activités","Compétences\npropres",null,"dates des évaluations","dates des rattrapages",null,"nbre APSA\n/ classe"]
[null,null,null,null,"CP","Liste"]
["Classe 1","Classe","FAUCHER MARTINE","Danse","CP3","N","2014-04-29","2014-05-06",{"$f":"IF(ISERROR(E5),1,\"\")","v":""},{"$f":"IF(COUNTA(D5:D10)<=2,\"\",COUNTA(D5:D10))","v":3}]
[null,"3è1",null,"Tennis de table","CP4","N","2014-07-11","2014-07-25",{"$f":"IF(ISERROR(E6),1,\"\")","v":""}]
[null,null,null,"Relais-vitesse","CP1","N","2014-09-30","2014-10-03",""]
[null,"nbre d'élèves :   ",null,null,"","",null,null,""]
[null,28,null,null,"","",null,null,""]
[null,null,null,null,"","",null,null,""]
["Classe 2","Classe","FAUCHER MARTINE","Danse","CP3","N","2014-04-28","2014-05-05","",{"$f":"IF(COUNTA(D11:D16)<=2,\"\",COUNTA(D11:D16))","v":3}]
[null,"3è2",null,"Tennis de table","CP4","N","2014-07-18","2014-08-01",""]
[null,null,null,"Relais-vitesse","CP1","N","2014-04-29","2014-10-06",""]
[null,"nbre d'élèves :   ",null,null,"","",null,null,""]
[null,29,null,null,"","",null,null,""]
[null,null,null,null,"","",null,null,""]
["Classe 3","Classe","CALI GUILLAUME","Tennis de table","CP4","N","2014-04-28","2014-05-05","",{"$f":"IF(COUNTA(D17:D22)<=2,\"\",COUNTA(D17:D22))","v":3}]
[null,"3è3",null,"Relais-vitesse","CP1","N","2014-07-25","2014-07-28",""]
[null,null,null,"Danse","CP3","N","2014-10-31","2014-11-03",""]
[null,"nbre d'élèves :   ",null,null,"","",null,null,""]
[null,28,null,null,"","",null,null,""]
[null,null,null,null,"","",null,null,""]
["Classe 4","Classe","CALI GUILLAUME","Tennis de table","CP4","N","2014-04-29","2014-05-06","",{"$f":"IF(COUNTA(D23:D28)<=2,\"\",COUNTA(D23:D28))","v":3}]
[null,"3è4",null,"Relais-vitesse","CP1","N","2014-07-22","2014-08-01",""]
[null,null,null,"Danse","CP3","N","2014-10-10","2014-10-28",""]
[null,"nbre d'élèves :   ",null,null,"","",null,null,""]
[null,29,null,null,"","",null,null,""]
[null,null,null,null,"","",null,null,""]
["Classe 5","Classe","BELLATON SYLVIE","Relais-vitesse","CP1","N","2014-04-25","2014-05-07","",{"$f":"IF(COUNTA(D29:D34)<=2,\"\",COUNTA(D29:D34))","v":3}]
[null,"3è5",null,"Danse","CP3","N","2014-07-25","2014-08-01",""]
[null,null,null,"Tennis de table","CP4","N","2014-10-08","2014-11-05",""]
[null,"nbre d'élèves :   ",null,null,"","",null,null,""]
[null,30,null,null,"","",null,null,""]
[null,null,null,null,"","",null,null,""]
["Classe 6","Classe","BELLATON SYLVIE","Relais-vitesse","CP1","N","2014-04-30","2014-05-05","",{"$f":"IF(COUNTA(D35:D40)<=2,\"\",COUNTA(D35:D40))","v":3}]
[null,"3è6",null,"Danse","CP3","N","2014-07-21","2014-07-28",""]
[null,null,null,"Tennis de table","CP4","N","2014-10-01","2014-10-29",""]
[null,"nbre d'élèves :   ",null,null,"","",null,null,""]
[null,26,null,null,"","",null,null,""]
[null,null,null,null,"","",null,null,""]
["Classe 7","Classe","prof7",null,"","",null,null,{"$f":"IF(ISERROR(E41),1,\"\")","v":""},{"$f":"IF(COUNTA(D41:D46)<=2,\"\",COUNTA(D41:D46))","v":""}]
[null,"3è7",null,null,"","",null,null,{"$f":"IF(ISERROR(E42),1,\"\")","v":""}]
[null,null,null,null,"","",null,null,""]
[null,"nbre d'élèves :   ",null,null,"","",null,null,""]
[null,null,null,null,"","",null,null,""]
[null,null,null,null,"","",null,null,""]
["Classe 8","Classe","prof8",null,"","",null,null,"",{"$f":"IF(COUNTA(D47:D52)<=2,\"\",COUNTA(D47:D52))","v":""}]
[null,"3è8",null,null,"","",null,null,""]
[null,null,null,null,"","",null,null,""]
[null,"nbre d'élèves :   ",null,null,"","",null,null,""]
[null,null,null,null,"","",null,null,""]
[null,null,null,null,"","",null,null,""]
["Classe 9","Classe","prof9",null,"","",null,null,"",{"$f":"IF(COUNTA(D53:D58)<=2,\"\",COUNTA(D53:D58))","v":""}]
[null,"3è9",null,null,"","",null,null,""]
[null,null,null,null,"","",null,null,""]
[null,"nbre d'élèves :   ",null,null,"","",null,null,""]
[null,null,null,null,"","",null,null,""]
[null,null,null,null,"","",null,null,""]
["Classe 10","Classe","prof10",null,"","",null,null,"",{"$f":"IF(COUNTA(D59:D64)<=2,\"\",COUNTA(D59:D64))","v":""}]
[null,"3è10",null,null,"","",null,null,""]
[null,null,null,null,"","",null,null,""]
[null,"nbre d'élèves :   ",null,null,"","",null,null,""]
[null,null,null,null,"","",null,null,""]
[null,null,null,null,"","",null,null,""]
["Classe 11","Classe","prof11",null,"","",null,null,"",{"$f":"IF(COUNTA(D65:D70)<=2,\"\",COUNTA(D65:D70))","v":""}]
[null,"3è11",null,null,"","",null,null,""]
[null,null,null,null,"","",null,null,""]
[null,"nbre d'élèves :   ",null,null,"","",null,null,""]
[null,null,null,null,"","",null,null,""]
[null,null,null,null,"","",null,null,""]
["Classe 12","Classe","prof12",null,"","",null,null,"",{"$f":"IF(COUNTA(D71:D76)<=2,\"\",COUNTA(D71:D76))","v":""}]
[null,"3è12",null,null,"","",null,null,""]
[null,null,null,null,"","",null,null,""]
[null,"nbre d'élèves :   ",null,null,"","",null,null,""]
[null,null,null,null,"","",null,null,""]
[null,null,null,null,"","",null,null,""]
[null,null,null,null,null,null,null,null,{"$f":"IF(COUNT(I5:I76)=0,\"\",\"Attention, une ou plusieurs APSA du protocole sont mal saisies!\")","v":""},{"$f":"AVERAGE(J5:J71)","v":3}]
[null,"Date de validation par le chef d'établissement :",null,null,null,null,null,null,null,{"$f":"COUNT(J5:J71)","v":6}]
[null,"Informations à transmettre à l'inspection :"]
[]
[null,null,null,null,null,null,null,null,""]
[]
[null,"Partie reservée à l'inspection :"]

{"sheet":"9830259P","index":60,"n_rows":83,"n_cols":10,"rows_kept":83,"cut":false,"hidden":false,"merged":[[64,0,69,0],[64,2,69,2],[70,0,75,0],[70,2,75,2],[28,2,33,2],[52,0,57,0],[52,2,57,2],[58,0,63,0],[58,2,63,2],[40,0,45,0],[40,2,45,2],[46,0,51,0],[46,2,51,2],[2,7,3,7],[4,0,9,0],[4,2,9,2],[10,0,15,0],[10,2,15,2],[16,0,21,0],[16,2,21,2],[2,6,3,6],[0,3,0,5],[2,1,3,1],[2,2,3,2],[2,3,3,3],[2,4,2,5],[34,0,39,0],[34,2,39,2],[22,0,27,0],[22,2,27,2],[28,0,33,0]]}
["R","DNB 2014","9830259P","CLG CHAMPAGNAT - NOUMEA",null,null,"PROVINCE SUD","Académie de Nouvelle-Calédonie",{"$f":"IF(C1=\"\",\"\",VLOOKUP(C1,etab,4,FALSE))","v":"privé"}]
["GEBEPS_2014_IPR_PROTOCOLES_privé_9830259P.xls",null,null,null,"",null,null,null,{"$f":"Données!M11","v":"V3_29/10/13"}]
[null,"CLASSES            évaluées pour le DNB","NOM \nde l'enseignant responsable de la classe","Activités","Compétences\npropres",null,"dates des évaluations","dates des rattrapages",null,"nbre APSA\n/ classe"]
[null,null,null,null,"CP","Liste"]
["Classe 1","Classe","ALPHAND T.","Tennis de table","CP4","N","2014-04-03","2014-04-24",{"$f":"IF(ISERROR(E5),1,\"\")","v":""},{"$f":"IF(COUNTA(D5:D10)<=2,\"\",COUNTA(D5:D10))","v":4}]
[null,"3A",null,"Planche à voile","CP2","A","2014-07-24","2014-07-31",{"$f":"IF(ISERROR(E6),1,\"\")","v":""}]
[null,null,null,"Volley","CP4","N","2014-10-09","2014-10-30",""]
[null,"nbre d'élèves :   ",null,"Demi-fond","CP1","N","2014-10-28","2014-11-04",""]
[null,22,null,null,"","",null,null,""]
[null,null,null,null,"","",null,null,""]
["Classe 2","Classe","DOUI A.","Volley","CP4","N","2014-04-28","2014-05-05","",{"$f":"IF(COUNTA(D11:D16)<=2,\"\",COUNTA(D11:D16))","v":3}]
[null,"3B",null,"Gymnastique sportive","CP3","N","2014-07-21","2014-07-28",""]
[null,null,null,"Relais-vitesse","CP1","N","2014-10-30","2014-11-06",""]
[null,"nbre d'élèves :   ",null,null,"","",null,null,""]
[null,24,null,null,"","",null,null,""]
[null,null,null,null,"","",null,null,""]
["Classe 3","Classe","ALPHAND T.","Tennis de table","CP4","N","2014-04-28","2014-05-05","",{"$f":"IF(COUNTA(D17:D22)<=2,\"\",COUNTA(D17:D22))","v":4}]
[null,"3C",null,"Volley","CP4","N","2014-07-21","2014-07-28",""]
[null,null,null,"Planche à voile","CP2","A","2014-07-21","2014-11-03",""]
[null,"nbre d'élèves :   ",null,"Demi-fond","CP1","N","2014-10-30","2014-11-06",""]
[null,23,null,null,"","",null,null,""]
[null,null,null,null,"","",null,null,""]
["Classe 4","Classe","CARPENTIER D.","Volley","CP4","N","2014-04-03","2014-04-24","",{"$f":"IF(COUNTA(D23:D28)<=2,\"\",COUNTA(D23:D28))","v":3}]
[null,"3D",null,"Demi-fond","CP1","N","2014-10-28","2014-11-04",""]
[null,null,null,"CO","CP2","N","2014-10-02","2014-10-30",""]
[null,"nbre d'élèves :   ",null,null,"","",null,null,""]
[null,22,null,null,"","",null,null,""]
[null,null,null,null,"","",null,null,""]
["Classe 5","Classe",null,null,"","",null,null,"",{"$f":"IF(COUNTA(D29:D34)<=2,\"\",COUNTA(D29:D34))","v":""}]
[null,null,null,null,"","",null,null,""]
[null,null,null,null,"","",null,null,""]
[null,"nbre d'élèves :   ",null,null,"","",null,null,""]
[null,null,null,null,"","",null,null,""]
[null,null,null,null,"","",null,null,""]
["Classe 6","Classe",null,null,"","",null,null,"",{"$f":"IF(COUNTA(D35:D40)<=2,\"\",COUNTA(D35:D40))","v":""}]
[null,null,null,null,"","",null,null,""]
[null,null,null,null,"","",null,null,""]
[null,"nbre d'élèves :   ",null,null,"","",null,null,""]
[null,null,null,null,"","",null,null,""]
[null,null,null,null,"","",null,null,""]
["Classe 7","Classe",null,null,"","",null,null,{"$f":"IF(ISERROR(E41),1,\"\")","v":""},{"$f":"IF(COUNTA(D41:D46)<=2,\"\",COUNTA(D41:D46))","v":""}]
[null,null,null,null,"","",null,null,{"$f":"IF(ISERROR(E42),1,\"\")","v":""}]
[null,null,null,null,"","",null,null,""]
[null,"nbre d'élèves :   ",null,null,"","",null,null,""]
[null,null,null,null,"","",null,null,""]
[null,null,null,null,"","",null,null,""]
["Classe 8","Classe",null,null,"","",null,null,"",{"$f":"IF(COUNTA(D47:D52)<=2,\"\",COUNTA(D47:D52))","v":""}]
[null,null,null,null,"","",null,null,""]
[null,null,null,null,"","",null,null,""]
[null,"nbre d'élèves :   ",null,null,"","",null,null,""]
[null,null,null,null,"","",null,null,""]
[null,null,null,null,"","",null,null,""]
["Classe 9","Classe",null,null,"","",null,null,"",{"$f":"IF(COUNTA(D53:D58)<=2,\"\",COUNTA(D53:D58))","v":""}]
[null,null,null,null,"","",null,null,""]
[null,null,null,null,"","",null,null,""]
[null,"nbre d'élèves :   ",null,null,"","",null,null,""]
[null,null,null,null,"","",null,null,""]
[null,null,null,null,"","",null,null,""]
["Classe 10","Classe",null,null,"","",null,null,"",{"$f":"IF(COUNTA(D59:D64)<=2,\"\",COUNTA(D59:D64))","v":""}]
[null,null,null,null,"","",null,null,""]
[null,null,null,null,"","",null,null,""]
[null,"nbre d'élèves :   ",null,null,"","",null,null,""]
[null,null,null,null,"","",null,null,""]
[null,null,null,null,"","",null,null,""]
["Classe 11","Classe",null,null,"","",null,null,"",{"$f":"IF(COUNTA(D65:D70)<=2,\"\",COUNTA(D65:D70))","v":""}]
[null,null,null,null,"","",null,null,""]
[null,null,null,null,"","",null,null,""]
[null,"nbre d'élèves :   ",null,null,"","",null,null,""]
[null,null,null,null,"","",null,null,""]
[null,null,null,null,"","",null,null,""]
["Classe 12","Classe",null,null,"","",null,null,"",{"$f":"IF(COUNTA(D71:D76)<=2,\"\",COUNTA(D71:D76))","v":""}]
[null,null,null,null,"","",null,null,""]
[null,null,null,null,"","",null,null,""]
[null,"nbre d'élèves :   ",null,null,"","",null,null,""]
[null,null,null,null,"","",null,null,""]
[null,null,null,null,"","",null,null,""]
[null,null,null,null,null,null,null,null,{"$f":"IF(COUNT(I5:I76)=0,\"\",\"Attention, une ou plusieurs APSA du protocole sont mal saisies!\")","v":""},{"$f":"AVERAGE(J5:J71)","v":3.5}]
[null,"Date de validation par le chef d'établissement :",null,null,null,null,"2014-06-24",null,null,{"$f":"COUNT(J5:J71)","v":4}]
[null,"Informations à transmettre à l'inspection :"]
[]
[null,null,null,null,null,null,null,null,""]
[]
[null,"Partie reservée à l'inspection :"]

{"sheet":"formules","index":61,"n_rows":78,"n_cols":10,"rows_kept":78,"cut":false,"hidden":true,"merged":[]}
[null,null,null,null,null,null,null,null,{"$f":"IF(C1=\"\",\"\",VLOOKUP(C1,etab,4,FALSE))","v":""}]
[null,null,null,null,null,null,null,null,{"$f":"Données!M11","v":"V3_29/10/13"}]
[null,null,null,null,null,null,null,null,null,"nbre APSA\n/ classe"]
[]
[null,null,null,null,null,null,null,null,{"$f":"IF(ISERROR(E5),1,\"\")","v":""},{"$f":"IF(COUNTA(D5:D10)<=2,\"\",COUNTA(D5:D10))","v":""}]
[null,null,null,null,null,null,null,null,{"$f":"IF(ISERROR(E6),1,\"\")","v":""}]
[null,null,null,null,null,null,null,null,""]
[null,null,null,null,null,null,null,null,""]
[null,null,null,null,null,null,null,null,""]
[null,null,null,null,null,null,null,null,""]
[null,null,null,null,null,null,null,null,"",{"$f":"IF(COUNTA(D11:D16)<=2,\"\",COUNTA(D11:D16))","v":""}]
[null,null,null,null,null,null,null,null,""]
[null,null,null,null,null,null,null,null,""]
[null,null,null,null,null,null,null,null,""]
[null,null,null,null,null,null,null,null,""]
[null,null,null,null,null,null,null,null,""]
[null,null,null,null,null,null,null,null,"",{"$f":"IF(COUNTA(D17:D22)<=2,\"\",COUNTA(D17:D22))","v":""}]
[null,null,null,null,null,null,null,null,""]
[null,null,null,null,null,null,null,null,""]
[null,null,null,null,null,null,null,null,""]
[null,null,null,null,null,null,null,null,""]
[null,null,null,null,null,null,null,null,""]
[null,null,null,null,null,null,null,null,"",{"$f":"IF(COUNTA(D23:D28)<=2,\"\",COUNTA(D23:D28))","v":""}]
[null,null,null,null,null,null,null,null,""]
[null,null,null,null,null,null,null,null,""]
[null,null,null,null,null,null,null,null,""]
[null,null,null,null,null,null,null,null,""]
[null,null,null,null,null,null,null,null,""]
[null,null,null,null,null,null,null,null,"",{"$f":"IF(COUNTA(D29:D34)<=2,\"\",COUNTA(D29:D34))","v":""}]
[null,null,null,null,null,null,null,null,""]
[null,null,null,null,null,null,null,null,""]
[null,null,null,null,null,null,null,null,""]
[null,null,null,null,null,null,null,null,""]
[null,null,null,null,null,null,null,null,""]
[null,null,null,null,null,null,null,null,"",{"$f":"IF(COUNTA(D35:D40)<=2,\"\",COUNTA(D35:D40))","v":""}]
[null,null,null,null,null,null,null,null,""]
[null,null,null,null,null,null,null,null,""]
[null,null,null,null,null,null,null,null,""]
[null,null,null,null,null,null,null,null,""]
[null,null,null,null,null,null,null,null,""]
[null,null,null,null,null,null,null,null,{"$f":"IF(ISERROR(E41),1,\"\")","v":""},{"$f":"IF(COUNTA(D41:D46)<=2,\"\",COUNTA(D41:D46))","v":""}]
[null,null,null,null,null,null,null,null,{"$f":"IF(ISERROR(E42),1,\"\")","v":""}]
[null,null,null,null,null,null,null,null,""]
[null,null,null,null,null,null,null,null,""]
[null,null,null,null,null,null,null,null,""]
[null,null,null,null,null,null,null,null,""]
[null,null,null,null,null,null,null,null,"",{"$f":"IF(COUNTA(D47:D52)<=2,\"\",COUNTA(D47:D52))","v":""}]
[null,null,null,null,null,null,null,null,""]
[null,null,null,null,null,null,null,null,""]
[null,null,null,null,null,null,null,null,""]
[null,null,null,null,null,null,null,null,""]
[null,null,null,null,null,null,null,null,""]
[null,null,null,null,null,null,null,null,"",{"$f":"IF(COUNTA(D53:D58)<=2,\"\",COUNTA(D53:D58))","v":""}]
[null,null,null,null,null,null,null,null,""]
[null,null,null,null,null,null,null,null,""]
[null,null,null,null,null,null,null,null,""]
[null,null,null,null,null,null,null,null,""]
[null,null,null,null,null,null,null,null,""]
[null,null,null,null,null,null,null,null,"",{"$f":"IF(COUNTA(D59:D64)<=2,\"\",COUNTA(D59:D64))","v":""}]
[null,null,null,null,null,null,null,null,""]
[null,null,null,null,null,null,null,null,""]
[null,null,null,null,null,null,null,null,""]
[null,null,null,null,null,null,null,null,""]
[null,null,null,null,null,null,null,null,""]
[null,null,null,null,null,null,null,null,"",{"$f":"IF(COUNTA(D65:D70)<=2,\"\",COUNTA(D65:D70))","v":""}]
[null,null,null,null,null,null,null,null,""]
[null,null,null,null,null,null,null,null,""]
[null,null,null,null,null,null,null,null,""]
[null,null,null,null,null,null,null,null,""]
[null,null,null,null,null,null,null,null,""]
[null,null,null,null,null,null,null,null,"",{"$f":"IF(COUNTA(D71:D76)<=2,\"\",COUNTA(D71:D76))","v":""}]
[null,null,null,null,null,null,null,null,""]
[null,null,null,null,null,null,null,null,""]
[null,null,null,null,null,null,null,null,""]
[null,null,null,null,null,null,null,null,""]
[null,null,null,null,null,null,null,null,""]
[null,null,null,null,null,null,null,null,{"$f":"IF(COUNT(I5:I76)=0,\"\",\"Attention, une ou plusieurs APSA du protocole sont mal saisies!\")","v":""},{"$f":"AVERAGE(J5:J71)","v":{"$error":"#DIV/0!"}}]
[null,null,null,null,null,null,null,null,null,{"$f":"COUNT(J5:J71)","v":0}]